Benzene, 1-nitro-4-(phenylmethoxy)-
- Formula: C13H11NO3
- Molecular weight: 229.2313
- IUPAC Standard InChIKey: YOVUXLHIVNBVKO-UHFFFAOYSA-N
- CAS Registry Number: 1145-76-2
- Chemical structure:
View 3d structure (requires JavaScript / HTML 5) - Other names: Benzyl p-nitrophenyl ether; Ether, benzyl p-nitrophenyl; 4-Benzyloxynitrobenzene; Nitrobenzene, 4-(phenylmethoxy)-; Benzyl 4-nitrophenyl ether; p-(benzyloxy)nitrobenzene

Gas phase ion energetics data

Data compiled by: Henry M. Rosenstock, Keith Draxl, Bruce W. Steiner, and John T. Herron
Ionization energy determinations
IE (eV) | Method | Reference |
---|---|---|
9.1 | EI | Ward, Cooks, et al., 1969 |
Appearance energy determinations
Ion | AE (eV) | Other Products | Method | Reference | Comment |
---|---|---|---|---|---|
C7H7+ | 10.0 | ? | EI | Ward, Cooks, et al., 1969 |

References

Ward, Cooks, et al., 1969
Ward, R.S.; Cooks, R.d.; Williams, D.H.,
Substituent effects in mass spectrometry. Mass spectra of substituted phenyl benzyl ethers,
J. Am. Chem. Soc., 1969, 91, 2727. [all data]