Methanone, (4-nitrophenyl)phenyl-
- Formula: C13H9NO3
- Molecular weight: 227.2155
- IUPAC Standard InChIKey: ZYMCBJWUWHHVRX-UHFFFAOYSA-N
- CAS Registry Number: 1144-74-7
- Chemical structure:
View 3d structure (requires JavaScript / HTML 5) - Other names: Benzophenone, 4-nitro-; 4-Nitrobenzophenone; p-Nitrobenzophenone; 4-Nitrophenyl phenyl ketone

Gas phase ion energetics data

Data compiled as indicated in comments:
LLK - Sharon G. Lias, Rhoda D. Levin, and Sherif A. Kafafi
B - John E. Bartmess
Electron affinity determinations
EA (eV) | Method | Reference | Comment |
---|---|---|---|
1.570 ± 0.087 | IMRE | Huh, Kang, et al., 1999 | ΔG(EA) 343K; anchored to ΔG value. Including anchor ΔS, EA is ca. 0.4 kcal/mol more bound.; B |
Ionization energy determinations
IE (eV) | Method | Reference | Comment |
---|---|---|---|
10. ± 0.1 | EI | Krenmayr, Heller, et al., 1974 | LLK |
10. ± 0.1 | EI | Heller, Varmuza, et al., 1974 | LLK |
Appearance energy determinations
Ion | AE (eV) | Other Products | Method | Reference | Comment |
---|---|---|---|---|---|
C6H5+ | 15.5 ± 0.3 | ? | EI | Krenmayr, Heller, et al., 1974 | LLK |
C7H4NO3+ | 12.4 ± 0.2 | ? | EI | Krenmayr, Heller, et al., 1974 | LLK |
C7H4NO3+ | 12.4 ± 0.2 | ? | EI | Heller, Varmuza, et al., 1974 | LLK |
C7H5O+ | 11.4 ± 0.1 | ? | EI | Krenmayr, Heller, et al., 1974 | LLK |
C13H8NO2+ | 11.5 ± 0.1 | ? | EI | Krenmayr, Heller, et al., 1974 | LLK |

References

Huh, Kang, et al., 1999
Huh, C.; Kang, C.H.; Lee, H.W.; Nakamura, H.; Mishima, M.; Tsuno, Y.; Yamataka, H.,
Thermodynamic stabilities and resonance demand of aromatic radical anions in the gas phase,
Bull. Chem. Soc. Japan, 1999, 72, 5, 1083-1091, https://doi.org/10.1246/bcsj.72.1083
. [all data]
Krenmayr, Heller, et al., 1974
Krenmayr, P.; Heller, R.; Varmuza, K.,
Massenspektrometrische untersuchungen an benzophenon und substituierten benzophenonen. I. Ermittlung thermodynamischer grossen,
Org. Mass Spectrom., 1974, 9, 998. [all data]
Heller, Varmuza, et al., 1974
Heller, R.; Varmuza, K.; Krenmayr, P.,
Massenspektrometrische untersuchung des substituenteneffektes bei einfach substituierten benzophenonen,
Monatsh. Chem., 1974, 105, 787. [all data]