Phenol, 3,5-bis(1,1-dimethylethyl)-
- Formula: C14H22O
- Molecular weight: 206.3239
- IUPAC Standard InChIKey: ZDWSNKPLZUXBPE-UHFFFAOYSA-N
- CAS Registry Number: 1138-52-9
- Chemical structure:
View 3d structure (requires JavaScript / HTML 5) - Other names: Phenol, 3,5-di-tert-butyl-; 3,5-Di-tert-butylphenol; Phenol, 3,5-bis(t-butyl); 3,5-Di-t-butylphenol; 3,5-bis(1,1-Dimethylethyl)phenol

Gas phase thermochemistry data

Data compiled by: Hussein Y. Afeefy, Joel F. Liebman, and Stephen E. Stein
Quantity | Value | Units | Method | Reference | Comment |
---|---|---|---|---|---|
ΔfH°gas | -300. | kJ/mol | Ccb | Bertholon, Giray, et al., 1971 |

Condensed phase thermochemistry data

Data compiled by: Hussein Y. Afeefy, Joel F. Liebman, and Stephen E. Stein
Quantity | Value | Units | Method | Reference | Comment |
---|---|---|---|---|---|
ΔfH°solid | -410. | kJ/mol | Ccb | Bertholon, Giray, et al., 1971 | |
Quantity | Value | Units | Method | Reference | Comment |
ΔcH°solid | -8242. | kJ/mol | Ccb | Bertholon, Giray, et al., 1971 | Corresponding ΔfHºsolid = -410. kJ/mol (simple calculation by NIST; no Washburn corrections) |

Phase change data

Data compiled as indicated in comments:
AC - William E. Acree, Jr., James S. Chickos
ALS - Hussein Y. Afeefy, Joel F. Liebman, and Stephen E. Stein
DRB - Donald R. Burgess, Jr.
Quantity | Value | Units | Method | Reference | Comment |
---|---|---|---|---|---|
ΔsubH° | 97.7 ± 3.7 | kJ/mol | C | da Silva, Matos, et al., 2001 | AC |
ΔsubH° | 110.0 | kJ/mol | C | Bertholon, Giray, et al., 1971 | ALS |
ΔsubH° | 110.0 | kJ/mol | N/A | Bertholon, Giray, et al., 1971 | DRB |
Enthalpy of sublimation
ΔsubH (kJ/mol) | Temperature (K) | Method | Reference | Comment |
---|---|---|---|---|
68.2 | 313.5 | A | Stephenson and Malanowski, 1987 | Based on data from 302. to 325. K.; AC |

Reaction thermochemistry data

Data compiled by: Hussein Y. Afeefy, Joel F. Liebman, and Stephen E. Stein
Individual Reactions
By formula: C6H6O + C14H22O = C10H14O + C10H14O
Quantity | Value | Units | Method | Reference | Comment |
---|---|---|---|---|---|
ΔrH° | 0.08 ± 0.71 | kJ/mol | Eqk | Pil'shchikov, Nesterova, et al., 1981 | liquid phase |

Gas phase ion energetics data

Data compiled as indicated in comments:
LLK - Sharon G. Lias, Rhoda D. Levin, and Sherif A. Kafafi
Ionization energy determinations
IE (eV) | Method | Reference | Comment |
---|---|---|---|
7.90 ± 0.02 | PE | Maier and Turner, 1973 | LLK |

Van Den Dool and Kratz RI, polar column, temperature ramp

Column type | Active phase | I | Reference | Comment |
---|---|---|---|---|
Capillary | DB-Wax | 2310. | Shimoda, Shigematsu, et al., 1995 | 60. m/0.25 mm/0.25 μm, 2. K/min; Tstart: 50. C; Tend: 230. C |

Normal alkane RI, polar column, temperature ramp

Column type | Active phase | I | Reference | Comment |
---|---|---|---|---|
Capillary | TC-FFAP | 2328. | Kurose and Yatagai, 2005 | 60. m/0.25 mm/0.4 μm, He, 3. K/min, 220. C @ 30. min; Tstart: 60. C |

References

Bertholon, Giray, et al., 1971
Bertholon, G.; Giray, M.; Perrin, R.; Vincent-Falquet-Berny, M.F.,
No. 532. - Etude physicochimique des phenols. OX. - Ethanlpies de combustion et energies de resonance des alcoyl et aryphenols,
Bull. Soc. Chim. France, 1971, 3180-3187. [all data]
da Silva, Matos, et al., 2001
da Silva, Manuel A.V. Ribeiro; Matos, M. Agostinha R.; Miranda, Margarida S.; Sousa, M. Helena F.A.; dos Santos, Rui M. Borges; Bizarro, Magda M.; Simões, José A. Martinho,
Structural Chemistry, 2001, 12, 2, 171-181, https://doi.org/10.1023/A:1016600727116
. [all data]
Stephenson and Malanowski, 1987
Stephenson, Richard M.; Malanowski, Stanislaw,
Handbook of the Thermodynamics of Organic Compounds, 1987, https://doi.org/10.1007/978-94-009-3173-2
. [all data]
Pil'shchikov, Nesterova, et al., 1981
Pil'shchikov, V.A.; Nesterova, T.N.; Rozhnov, A.M.,
Equilibrium in the system phenol-tert-butylphenols,
J. Appl. Chem. USSR, 1981, 54, 1765-1769. [all data]
Maier and Turner, 1973
Maier, J.P.; Turner, D.W.,
Steric inhibition of resonance studied by molecular photoelectron spectroscopy Part 3. Anilines, Phenols and Related Compounds,
J. Chem. Soc. Faraday Trans. 2, 1973, 69, 521. [all data]
Shimoda, Shigematsu, et al., 1995
Shimoda, M.; Shigematsu, H.; Shiratsuchi, H.; Osajima, Y.,
Comparison of the odor concentrates by SDE and adsorptive column method from green tea infusion,
J. Agric. Food Chem., 1995, 43, 6, 1616-1620, https://doi.org/10.1021/jf00054a037
. [all data]
Kurose and Yatagai, 2005
Kurose, K.; Yatagai, M.,
Components of the essential oils of Azadirachta indica A. Juss, Azadirachta siamensis Velton, and Azadirachta excelsa (Jack) Jacobs and their comparison,
J. Wood Sci., 2005, 51, 2, 185-188, https://doi.org/10.1007/s10086-004-0640-4
. [all data]