(cis)-1,1'-(1,2-cyclopropanediyl)bisbenzene
- Formula: C15H14
- Molecular weight: 194.2717
- IUPAC Standard InChIKey: ZSIYTDQNAOYUNE-GASCZTMLSA-N
- CAS Registry Number: 1138-48-3
- Chemical structure:
View 3d structure (requires JavaScript / HTML 5) - Stereoisomers:
- Other names: cis-1,2-Diphenylcyclopropane

Condensed phase thermochemistry data

Data compiled by: Hussein Y. Afeefy, Joel F. Liebman, and Stephen E. Stein
Quantity | Value | Units | Method | Reference | Comment |
---|---|---|---|---|---|
ΔfH°liquid | 179. ± 0.8 | kJ/mol | Ccb | Kozina, Lukina, et al., 1961 | |
Quantity | Value | Units | Method | Reference | Comment |
ΔcH°liquid | -8082.2 ± 0.8 | kJ/mol | Ccb | Kozina, Lukina, et al., 1961 | Corresponding ΔfHºliquid = 179. kJ/mol (simple calculation by NIST; no Washburn corrections) |

Gas phase ion energetics data

Data compiled as indicated in comments:
LLK - Sharon G. Lias, Rhoda D. Levin, and Sherif A. Kafafi
Ionization energy determinations
IE (eV) | Method | Reference | Comment |
---|---|---|---|
8.20 | PE | Arnold and Wong, 1979 | LLK |

References

Kozina, Lukina, et al., 1961
Kozina, M.P.; Lukina, M.Yu.; Zubareya, N.D.; Safonova, I.L.; Skuratov, S.M.; Kazansky, B.A.,
The energy of combustion of some phenylcyclopropanes,
Dokl. Akad. Nauk SSSR, 1961, 138, 843-845. [all data]
Arnold and Wong, 1979
Arnold, D.R.; Wong, P.C.,
The oxidation potentials of cis- and trans-1,2-diphenylcyclo- propane and cis- and trans-2,3-diphenyloxirane,
Can. J. Chem., 1979, 57, 2098. [all data]