Methanone, (4-aminophenyl)phenyl-
- Formula: C13H11NO
- Molecular weight: 197.2325
- IUPAC Standard InChIKey: RBKHNGHPZZZJCI-UHFFFAOYSA-N
- CAS Registry Number: 1137-41-3
- Chemical structure:
View 3d structure (requires JavaScript / HTML 5) - Other names: Benzophenone, 4-amino-; p-Aminobenzophenone; p-Benzoylaniline; 4-Aminobenzophenone; USAF A-233; (4-Amino-phenyl)phenylmethanone; 4-Benzoylaniline; 4-Aminophenyl phenyl ketone; NSC 7665; 4-Benzoylbenzenamine

Phase change data

Data compiled as indicated in comments:
BS - Robert L. Brown and Stephen E. Stein
TRC - Thermodynamics Research Center, NIST Boulder Laboratories, Chris Muzny director
Quantity | Value | Units | Method | Reference | Comment |
---|---|---|---|---|---|
Tfus | 397. | K | N/A | Buckingham and Donaghy, 1982 | BS |
Tfus | 395.9 | K | N/A | Montagne, 1923 | Uncertainty assigned by TRC = 1.5 K; TRC |
Reduced pressure boiling point
Tboil (K) | Pressure (bar) | Reference | Comment |
---|---|---|---|
519. | 0.017 | Buckingham and Donaghy, 1982 | BS |

Gas phase ion energetics data

Data compiled by: Sharon G. Lias, Rhoda D. Levin, and Sherif A. Kafafi
Ionization energy determinations
IE (eV) | Method | Reference |
---|---|---|
8.4 ± 0.1 | EI | Krenmayr, Heller, et al., 1974 |
8.4 ± 0.1 | EI | Heller, Varmuza, et al., 1974 |
Appearance energy determinations
Ion | AE (eV) | Other Products | Method | Reference | Comment |
---|---|---|---|---|---|
C6H6N+ | 15.5 ± 0.3 | ? | EI | Krenmayr, Heller, et al., 1974 | |
C7H5O+ | 12.5 ± 0.2 | ? | EI | Krenmayr, Heller, et al., 1974 | |
C7H6NO+ | 11.3 ± 0.1 | ? | EI | Krenmayr, Heller, et al., 1974 | |
C7H6NO+ | 11.3 ± 0.1 | ? | EI | Heller, Varmuza, et al., 1974 | |
C13H8O+ | 11.5 ± 0.2 | ? | EI | Krenmayr, Heller, et al., 1974 |

References

Buckingham and Donaghy, 1982
Buckingham, J.; Donaghy, S.M.,
Dictionary of Organic Compounds: Fifth Edition, Chapman and Hall, New York, 1982, 1. [all data]
Montagne, 1923
Montagne, P.J.,
The Action of Alcoholic Potash on Ketones,
Recl. Trav. Chim. Pays-Bas, 1923, 42, 499. [all data]
Krenmayr, Heller, et al., 1974
Krenmayr, P.; Heller, R.; Varmuza, K.,
Massenspektrometrische untersuchungen an benzophenon und substituierten benzophenonen. I. Ermittlung thermodynamischer grossen,
Org. Mass Spectrom., 1974, 9, 998. [all data]
Heller, Varmuza, et al., 1974
Heller, R.; Varmuza, K.; Krenmayr, P.,
Massenspektrometrische untersuchung des substituenteneffektes bei einfach substituierten benzophenonen,
Monatsh. Chem., 1974, 105, 787. [all data]
Porter, 1966
Porter, G.,
UV of organic compaunds, 1966, 2, D11/13. [all data]