Ruthenium, bis(η5-1,2,3,4,5,6-hexamethylcyclohexa-2,4-dien-1-yl)-

Gas phase ion energetics data

Data compiled by: Sharon G. Lias, John E. Bartmess, Joel F. Liebman, John L. Holmes, Rhoda D. Levin, and W. Gary Mallard

Ionization energy determinations

IE (eV) Method Reference Comment
6.2PEStahl, Ma, et al., 1987Vertical value

References

Stahl, Ma, et al., 1987
Stahl, L.; Ma, H.; Ernst, R.D., Synthetic, structural and pe spectroscopic studies on bis(pentadienyl) compounds of iron, ruthenium and osmium. The role of the heavy metal, J. Organomet. Chem., 1987, 326, 257. [all data]