Guanidine
- Formula: CH5N3
- Molecular weight: 59.0705
- IUPAC Standard InChIKey: ZRALSGWEFCBTJO-UHFFFAOYSA-N
- CAS Registry Number: 113-00-8
- Chemical structure:
View 3d structure (requires JavaScript / HTML 5) - Other names: Aminoformamidine; Aminomethanamidine; Carbamamidine; Carbamidine; Guanidin; Imidourea; Iminourea; (NH2)2C=NH

Condensed phase thermochemistry data

Data compiled by: Hussein Y. Afeefy, Joel F. Liebman, and Stephen E. Stein
Quantity | Value | Units | Method | Reference | Comment |
---|---|---|---|---|---|
ΔfH°solid | -13.4 ± 0.3 | kcal/mol | Ccb | Kirpichev, Titov, et al., 1968 | |
Quantity | Value | Units | Method | Reference | Comment |
ΔcH°solid | -251.46 ± 0.25 | kcal/mol | Ccb | Kirpichev, Titov, et al., 1968 |

Gas phase ion energetics data

Data evaluated as indicated in comments:
HL - Edward P. Hunter and Sharon G. Lias
Data compiled as indicated in comments:
RDSH - Henry M. Rosenstock, Keith Draxl, Bruce W. Steiner, and John T. Herron
Quantity | Value | Units | Method | Reference | Comment |
---|---|---|---|---|---|
Proton affinity (review) | 235.7 | kcal/mol | N/A | Hunter and Lias, 1998 | HL |
Quantity | Value | Units | Method | Reference | Comment |
Gas basicity | 226.9 | kcal/mol | N/A | Hunter and Lias, 1998 | HL |
Ionization energy determinations
IE (eV) | Method | Reference | Comment |
---|---|---|---|
9.10 ± 0.05 | EI | Loudon, Maccoll, et al., 1968 | RDSH |

References

Kirpichev, Titov, et al., 1968
Kirpichev, E.P.; Titov, L.V.; Rubtsov, Yu.I.; Gavrilova, L.A.,
The heat of formation of guanidine,
Russ. J. Phys. Chem. (Engl. Transl.), 1968, 42, 269-270. [all data]
Hunter and Lias, 1998
Hunter, E.P.; Lias, S.G.,
Evaluated Gas Phase Basicities and Proton Affinities of Molecules: An Update,
J. Phys. Chem. Ref. Data, 1998, 27, 3, 413-656, https://doi.org/10.1063/1.556018
. [all data]
Loudon, Maccoll, et al., 1968
Loudon, A.G.; Maccoll, A.; Webb, K.S.,
Charge location and fragmentation in mass spectrometry. II. The mass spectra and ionization potentials of some methylguanidines,
Advan. Mass Spectrom., 1968, 4, 223. [all data]
Klotz and Askounts, 1947
Klotz, I.M.; Askounts, T.,
J. Am. Chem. Soc., 1947, 69, 801. [all data]