1-Octadecanol
- Formula: C18H38O
- Molecular weight: 270.4937
- IUPAC Standard InChIKey: GLDOVTGHNKAZLK-UHFFFAOYSA-N
- CAS Registry Number: 112-92-5
- Chemical structure:
View 3d structure (requires JavaScript / HTML 5) - Other names: n-Octadecanol; n-Octadecyl alcohol; n-1-Octadecanol; Aldol 62; Alfol 18; Atalco S; Cachalot S-43; Crodacol-S; Lanol S; Lorol 28; Octadecan-1-ol; Octadecyl alcohol; Sipol S; Siponol S; Siponol SC; Stearol; Stearyl alcohol; Stenol; Steraffine; Decyl octyl alcohol; Adol 68; Dytol e-46; Octadecanol; Polaax; Usp XIII stearyl alcohol; CO-1895; CO-1897; Kalcohl 80; Conol 30F; 1-Hydroxyoctadecane; C18 Linear alcohol; Cachalot S-56; CO 1895F; Conol 1675; Crodacol S70; Crodacol S95NF; Lanette 18 DEO; Lorol C18; Octadecanol NF; Philcohol 1800; Rita SA; Stearyl alcohol NF; Stearyl alcohol USP; Varonic BG; Octanodecanol; 1-Stearyl alcohol; Stearic alcohol; Rofamol; Kalcohl 8098; Adol 62; SSD AF (Salt/Mix); Ceteareth-20 (Salt/Mix)

Condensed phase thermochemistry data

Data compiled as indicated in comments:
DH - Eugene S. Domalski and Elizabeth D. Hearing
ALS - Hussein Y. Afeefy, Joel F. Liebman, and Stephen E. Stein
Quantity | Value | Units | Method | Reference | Comment |
---|---|---|---|---|---|
ΔcH°solid | -11820. ± 4. | kJ/mol | Ccb | Freeman and Bagby, 1989 | Corresponding ΔfHºsolid = -690. kJ/mol (simple calculation by NIST; no Washburn corrections); ALS |
Constant pressure heat capacity of liquid
Cp,liquid (J/mol*K) | Temperature (K) | Reference | Comment |
---|---|---|---|
705.2 | 343.15 | Khasanshin and Zykova, 1989 | T = 343 to 583 K.; DH |

Phase change data

Data compiled as indicated in comments:
BS - Robert L. Brown and Stephen E. Stein
TRC - Thermodynamics Research Center, NIST Boulder Laboratories, Chris Muzny director
AC - William E. Acree, Jr., James S. Chickos
ALS - Hussein Y. Afeefy, Joel F. Liebman, and Stephen E. Stein
Quantity | Value | Units | Method | Reference | Comment |
---|---|---|---|---|---|
Tfus | 331. ± 2. | K | AVG | N/A | Average of 18 values; Individual data points |
Quantity | Value | Units | Method | Reference | Comment |
Ttriple | 330.95 | K | N/A | Spizzichino, 1956 | Uncertainty assigned by TRC = 1. K; TRC |
Quantity | Value | Units | Method | Reference | Comment |
Ptriple | 2.933×10-7 | bar | N/A | Spizzichino, 1956 | Uncertainty assigned by TRC = 1.3×10-7 bar; TRC |
Quantity | Value | Units | Method | Reference | Comment |
ΔvapH° | 116.8 ± 1.2 | kJ/mol | CGC | Nichols, Kweskin, et al., 2006 | AC |
Quantity | Value | Units | Method | Reference | Comment |
ΔsubH° | 187. ± 1. | kJ/mol | V | Davies and Kybett, 1965 | ALS |
ΔsubH° | 191.2 ± 1.3 | kJ/mol | N/A | Davies and Kybett, 1965 | AC |
Reduced pressure boiling point
Tboil (K) | Pressure (bar) | Reference | Comment |
---|---|---|---|
443.7 | 0.003 | Aldrich Chemical Company Inc., 1990 | BS |
483.7 | 0.020 | Weast and Grasselli, 1989 | BS |
Enthalpy of vaporization
ΔvapH (kJ/mol) | Temperature (K) | Method | Reference | Comment |
---|---|---|---|---|
86.4 | 450. | A | Stephenson and Malanowski, 1987 | Based on data from 435. to 504. K.; AC |
76.3 | 515. | A | Stephenson and Malanowski, 1987 | Based on data from 500. to 573. K.; AC |
113.5 | 345. | A,ME | Stephenson and Malanowski, 1987 | Based on data from 334. to 356. K. See also Davies and Kybett, 1965.; AC |
Antoine Equation Parameters
log10(P) = A − (B / (T + C))
P = vapor pressure (bar)
T = temperature (K)
View plot Requires a JavaScript / HTML 5 canvas capable browser.
Temperature (K) | A | B | C | Reference | Comment |
---|---|---|---|---|---|
435.94 to 518.67 | 3.8588 | 1750.833 | -172.151 | Ambrose, Ellender, et al., 1974 | Coefficents calculated by NIST from author's data. |
495.09 to 574.30 | 4.21119 | 1986.921 | -151.128 | Ambrose and Sprake, 1970 | Coefficents calculated by NIST from author's data. |
Enthalpy of sublimation
ΔsubH (kJ/mol) | Temperature (K) | Method | Reference | Comment |
---|---|---|---|---|
187.4 ± 1.3 | 324. | ME | Davies and Kybett, 1965 | Based on data from 318. to 329. K. See also Stephenson and Malanowski, 1987.; AC |
Enthalpy of fusion
ΔfusH (kJ/mol) | Temperature (K) | Method | Reference | Comment |
---|---|---|---|---|
40.1 | 330.1 | DSC | Ventol«65533», Calvet, et al., 2004 | AC |
40.1 | 330.3 | N/A | Ventolà, Ramírez, et al., 2002 | AC |
66.67 | 331.2 | N/A | van Miltenburg, Oonk, et al., 2001 | AC |
70.08 | 334.2 | N/A | Chickos, Braton, et al., 1991 | AC |

Henry's Law data

Data compiled by: Rolf Sander
Henry's Law constant (water solution)
kH(T) = k°H exp(d(ln(kH))/d(1/T) ((1/T) - 1/(298.15 K)))
k°H = Henry's law constant for solubility in water at 298.15 K (mol/(kg*bar))
d(ln(kH))/d(1/T) = Temperature dependence constant (K)
k°H (mol/(kg*bar)) | d(ln(kH))/d(1/T) (K) | Method | Reference | Comment |
---|---|---|---|---|
91. | Q | N/A | missing citation give several references for the Henry's law constants but don't assign them to specific species. Value at T = 307. K. |

Van Den Dool and Kratz RI, non-polar column, temperature ramp

Data compiled by: NIST Mass Spectrometry Data Center, William E. Wallace, director

Column type CapillaryCapillaryCapillaryCapillaryCapillary
Active phase HP-5MSDB-5HP-5HP-5MSDB-5
Column length (m) 30.25.30.30.30.
Carrier gas HeN2He H2
Substrate
Column diameter (mm) 0.250.250.250.250.25
Phase thickness (μm) 0.250.250.250.250.25
Tstart (C) 60.75.60.50.60.
Tend (C) 280.210.280.280.240.
Heat rate (K/min) 3.3.4.3.3.
Initial hold (min)  10.5.5.
Final hold (min)  1.
I 2081.2080.2082.2090.2084.
ReferenceKukic J., Petrovic S., et al., 2006bin Jantan, Yalvema, et al., 2005Skaltsa, Demetzos, et al., 2003Demetzos, Angelopoulou, et al., 2002Nogueira, Bittrich, et al., 2001
Comment MSDC-RI MSDC-RI MSDC-RI MSDC-RI MSDC-RI
Column type CapillaryCapillaryCapillaryCapillaryCapillary
Active phase CP Sil 5 CBHP-5MSHP-5DB-1Ultra-1
Column length (m) 50.30.30.15.12.5
Carrier gas HeHeHe He
Substrate
Column diameter (mm) 0.320.250.250.530.20
Phase thickness (μm) 0.40.250.251.0.11
Tstart (C) 60.60.50.40.120.
Tend (C) 280.280.280.250.325.
Heat rate (K/min) 3.4.4.8.5.
Initial hold (min) 10.5.5.4.
Final hold (min) 60.   5.
I 2070.2082.2081.2059.2061.
ReferencePino and Marbot, 2001Skaltsa, Mavrommati, et al., 2001Lazari, Skaltsa, et al., 2000Peng, 1992Tokuda, Saitoh, et al., 1988
Comment MSDC-RI MSDC-RI MSDC-RI MSDC-RI MSDC-RI
Column type CapillaryCapillary
Active phase Ultra-1DB-5
Column length (m) 12.530.
Carrier gas HeHe
Substrate
Column diameter (mm) 0.200.26
Phase thickness (μm) 0.110.25
Tstart (C) 120.50.
Tend (C) 325.300.
Heat rate (K/min) 5.6.
Initial hold (min)  4.
Final hold (min) 5.20.
I 2061.2086.
ReferenceTokuda, Saitoh, et al., 1988Rostad and Pereira, 1986
Comment MSDC-RI MSDC-RI

Kovats' RI, non-polar column, temperature ramp

Data compiled by: NIST Mass Spectrometry Data Center, William E. Wallace, director

Column type CapillaryCapillaryCapillaryCapillary
Active phase BP-1BP-1OV-101OV-101
Column length (m) 25.30.50.50.
Carrier gas N2N2
Substrate
Column diameter (mm) 0.320.320.230.23
Phase thickness (μm) 0.250.25
Tstart (C) 60.60.80.80.
Tend (C) 220.220.200.200.
Heat rate (K/min) 5.5.2.2.
Initial hold (min)
Final hold (min) 13.3.
I 2061.2067.2050.2050.
ReferenceRaina, Verma, et al., 2006Srivastava, Srivastava, et al., 2006Ohnishi and Shibamoto, 1984Ohnishi and Shibamoto, 1984
Comment MSDC-RI MSDC-RI MSDC-RI MSDC-RI

Kovats' RI, polar column, isothermal

Data compiled by: NIST Mass Spectrometry Data Center, William E. Wallace, director

Column type CapillaryCapillaryCapillaryCapillaryCapillary
Active phase CP-WaxDB-WaxOV-351OV-351OV-351
Column length (m) 25.25.25.25.25.
Carrier gas   N2N2N2
Substrate
Column diameter (mm) 0.250.250.320.320.32
Phase thickness (μm) 0.220.22
Temperature (C) 240.240.160.180.200.
I 2549.2585.2563.2570.2574.
ReferenceHanai and Hong, 1989Hanai and Hong, 1989Haken and Korhonen, 1985Haken and Korhonen, 1985Haken and Korhonen, 1985
Comment MSDC-RI MSDC-RI MSDC-RI MSDC-RI MSDC-RI
Column type Capillary
Active phase OV-351
Column length (m) 25.
Carrier gas N2
Substrate
Column diameter (mm) 0.32
Phase thickness (μm)
Temperature (C) 220.
I 2573.
ReferenceHaken and Korhonen, 1985
Comment MSDC-RI

References

Freeman and Bagby, 1989
Freeman, B.; Bagby, M.O.,
Heats of combustion of fatty esters and triglycerides,
J. Am. Oil Chem. Soc., 1989, 66, 1601-1605. [all data]
Khasanshin and Zykova, 1989
Khasanshin, T.S.; Zykova, T.B.,
Specific heat of saturated monatomic alcohols,
Inzh. -Fiz. Zhur., 1989, 56(6), 991-994. [all data]
Spizzichino, 1956
Spizzichino, C.,
Contribution a l'etude des tensions de vapeur et des chaleurs de vaporisation des acides gras, esters methyliques et alcools gras a des pressions inferieures a 1 mm de mercure,
J. des Recherches du C.N.R.S., 1956, 34, 1-24. [all data]
Nichols, Kweskin, et al., 2006
Nichols, Gary; Kweskin, Sasha; Frericks, Margaret; Reiter, Sarah; Wang, Gin; Orf, Jennifer; Carvallo, Brett; Hillesheim, Dorothea; Chickos, James,
Evaluation of the Vaporization, Fusion, and Sublimation Enthalpies of the 1-Alkanols: The Vaporization Enthalpy of 1-, 6-, 7-, and 9-Heptadecanol, 1-Octadecanol, 1-Eicosanol, 1-Docosanol, 1-Hexacosanol, and Cholesterol at T = 298.15 K by Correlation Gas Chromatography,
J. Chem. Eng. Data, 2006, 51, 2, 475-482, https://doi.org/10.1021/je0503857
. [all data]
Davies and Kybett, 1965
Davies, M.; Kybett, B.,
Sublimation and vaporization heats of long-chain alcohols,
Trans. Faraday Soc., 1965, 61, 1608. [all data]
Aldrich Chemical Company Inc., 1990
Aldrich Chemical Company Inc.,
Catalog Handbook of Fine Chemicals, Aldrich Chemical Company, Inc., Milwaukee WI, 1990, 1. [all data]
Weast and Grasselli, 1989
CRC Handbook of Data on Organic Compounds, 2nd Editon, Weast,R.C and Grasselli, J.G., ed(s)., CRC Press, Inc., Boca Raton, FL, 1989, 1. [all data]
Stephenson and Malanowski, 1987
Stephenson, Richard M.; Malanowski, Stanislaw,
Handbook of the Thermodynamics of Organic Compounds, 1987, https://doi.org/10.1007/978-94-009-3173-2
. [all data]
Ambrose, Ellender, et al., 1974
Ambrose, D.; Ellender, J.H.; Sprake, C.H.S.,
Thermodynamic properties of organic oxygen compounds XXXV. Vapour pressures of aliphatic alcohols,
The Journal of Chemical Thermodynamics, 1974, 6, 9, 909-914, https://doi.org/10.1016/0021-9614(74)90235-3
. [all data]
Ambrose and Sprake, 1970
Ambrose, D.; Sprake, C.H.S.,
Thermodynamic properties of organic oxygen compounds XXV. Vapour pressures and normal boiling temperatures of aliphatic alcohols,
The Journal of Chemical Thermodynamics, 1970, 2, 5, 631-645, https://doi.org/10.1016/0021-9614(70)90038-8
. [all data]
Ventol«65533», Calvet, et al., 2004
Ventol«65533», L.; Calvet, T.; Cuevas-Diarte, M.A.; Ram«65533»rez, M.; Oonk, H.A.J.; Mondieig, D.; Negrier, Ph.,
Melting behaviour in the n-alkanol family. Enthalpy?entropy compensation,
Phys. Chem. Chem. Phys., 2004, 6, 8, 1786, https://doi.org/10.1039/b313106h
. [all data]
Ventolà, Ramírez, et al., 2002
Ventolà, L.; Ramírez, M.; Calvet, T.; Solans, X.; Cuevas-Diarte, M.A.; Negrier, P.; Mondieig, D.; van Miltenburg, J.C.; Oonk, H.A.J.,
Polymorphism of N -Alkanols: 1-Heptadecanol, 1-Octadecanol, 1-Nonadecanol, and 1-Eicosanol,
Chem. Mater., 2002, 14, 2, 508-517, https://doi.org/10.1021/cm011010h
. [all data]
van Miltenburg, Oonk, et al., 2001
van Miltenburg, J. Cees; Oonk, Harry A.J.; Ventola, Lourdes,
Heat Capacities and Derived Thermodynamic Functions of 1-Octadecanol, 1-Nonadecanol, 1-Eicosanol, and 1-Docosanol between 10 K and 370 K,
J. Chem. Eng. Data, 2001, 46, 1, 90-97, https://doi.org/10.1021/je000048s
. [all data]
Chickos, Braton, et al., 1991
Chickos, James S.; Braton, C. Marie; Hesse, Donald G.; Liebman, Joel F.,
Estimating entropies and enthalpies of fusion of organic compounds,
J. Org. Chem., 1991, 56, 3, 927-938, https://doi.org/10.1021/jo00003a007
. [all data]