Oleic Acid
- Formula: C18H34O2
- Molecular weight: 282.4614
- IUPAC Standard InChIKey: ZQPPMHVWECSIRJ-KTKRTIGZSA-N
- CAS Registry Number: 112-80-1
- Chemical structure:
View 3d structure (requires JavaScript / HTML 5) - Stereoisomers:
- Other names: 9-Octadecenoic acid (Z)-; Δ9-cis-Oleic acid; cis-Oleic Acid; cis-9-Octadecenoic Acid; Emersol 211; Emersol 220 White Oleic Acid; Emersol 221 Low Titer White Oleic Acid; Oelsauere; Oleine 7503; Pamolyn 100; Vopcolene 27; Wecoline OO; Z-9-Octadecenoic acid; cis-Octadec-9-enoic acid; cis-Δ9-octadecenoic acid; cis-Δ9-Octadecenoate; neo-Fat 90-04; neo-Fat 92-04; Century cd fatty acid; Elaidoic acid; Emersol 210; Emersol 213; Emersol 6321; Glycon RO; Glycon WO; Groco 2; Groco 4; Groco 5l; Groco 6; Hy-phi 1055; Hy-phi 1088; Hy-phi 2066; Hy-phi 2088; Hy-phi 2102; K 52; L'Acide oleique; Metaupon; Tego-oleic 130; 9-Octadecenoic acid, cis-; Elaic acid; Industrene 105; Industrene 205; Industrene 206; Oleinic acid; Pamolyn; Wochem no. 320; (Z)-9-Octadecanoic acid; Emersol 6313 NF; Priolene 6906; 9-(Z)-octadecenoic acid; (Z)-Octadec-9-enoic acid; 9-Octadecenoic acid (9Z)-; D 100; Emersol 205; Extraolein 90

Condensed phase thermochemistry data

Data compiled by: Hussein Y. Afeefy, Joel F. Liebman, and Stephen E. Stein
Quantity | Value | Units | Method | Reference | Comment |
---|---|---|---|---|---|
ΔfH°liquid | -764.8 | kJ/mol | Chyd | Rogers, Hoyte, et al., 1978 | Authors gave two values |
Quantity | Value | Units | Method | Reference | Comment |
ΔcH°liquid | -11160.7 | kJ/mol | Ccb | Keffler, 1930 | At 293 °K; Corresponding ΔfHºliquid = -781.65 kJ/mol (simple calculation by NIST; no Washburn corrections) |

Phase change data

Data compiled as indicated in comments:
BS - Robert L. Brown and Stephen E. Stein
TRC - Thermodynamics Research Center, NIST Boulder Laboratories, Chris Muzny director
AC - William E. Acree, Jr., James S. Chickos
DH - Eugene S. Domalski and Elizabeth D. Hearing
Quantity | Value | Units | Method | Reference | Comment |
---|---|---|---|---|---|
Tfus | 289.45 | K | N/A | Mod, Magne, et al., 1962 | Uncertainty assigned by TRC = 0.3 K; TRC |
Tfus | 289.45 | K | N/A | Mod, Magne, et al., 1960 | Uncertainty assigned by TRC = 0.5 K; TRC |
Reduced pressure boiling point
Tboil (K) | Pressure (bar) | Reference | Comment |
---|---|---|---|
467.7 | 0.001 | Aldrich Chemical Company Inc., 1990 | BS |
Enthalpy of vaporization
ΔvapH (kJ/mol) | Temperature (K) | Method | Reference | Comment |
---|---|---|---|---|
83.8 | 456. | A | Stephenson and Malanowski, 1987 | Based on data from 441. to 633. K.; AC |
Antoine Equation Parameters
log10(P) = A − (B / (T + C))
P = vapor pressure (bar)
T = temperature (K)
View plot Requires a JavaScript / HTML 5 canvas capable browser.
Temperature (K) | A | B | C | Reference | Comment |
---|---|---|---|---|---|
449.7 to 633. | 5.04842 | 2555.604 | -127.258 | Stull, 1947 | Coefficents calculated by NIST from author's data. |
Enthalpy of fusion
ΔfusH (kJ/mol) | Temperature (K) | Reference | Comment |
---|---|---|---|
39.6 | 286.5 | Domalski and Hearing, 1996 | AC |
Enthalpy of phase transition
ΔHtrs (kJ/mol) | Temperature (K) | Initial Phase | Final Phase | Reference | Comment |
---|---|---|---|---|---|
39.600 | 286.45 | crystaline, α | liquid | Sato, Yoshimoto, et al., 1990 | High-melting, α-form.; DH |
51.900 | 289.35 | crystaline, β | liquid | Sato, Yoshimoto, et al., 1990 | Low-melting, β-form.; DH |
Entropy of phase transition
ΔStrs (J/mol*K) | Temperature (K) | Initial Phase | Final Phase | Reference | Comment |
---|---|---|---|---|---|
138.4 | 286.45 | crystaline, α | liquid | Sato, Yoshimoto, et al., 1990 | High-melting,; DH |
179.3 | 289.35 | crystaline, β | liquid | Sato, Yoshimoto, et al., 1990 | Low-melting,; DH |

Reaction thermochemistry data

Data compiled by: Hussein Y. Afeefy, Joel F. Liebman, and Stephen E. Stein
Individual Reactions
By formula: C18H34O2 + H2 = C18H36O2
Quantity | Value | Units | Method | Reference | Comment |
---|---|---|---|---|---|
ΔrH° | -123.6 ± 1.6 | kJ/mol | Chyd | Rogers, Hoyte, et al., 1978 | liquid phase; solvent: Hexane; Authors gave two values |
ΔrH° | -125.1 ± 0.8 | kJ/mol | Chyd | Rogers, Hoyte, et al., 1978 | liquid phase; solvent: Hexane; Authors gave two values |

Normal alkane RI, non-polar column, custom temperature program

Data compiled by: NIST Mass Spectrometry Data Center, William E. Wallace, director

Column type CapillaryCapillaryCapillaryCapillaryCapillary
Active phase VF-5 MSDB-1ZB-1 MSHP-5 MSRTX-5 MS
Column length (m) 30.30.30.30.30.
Carrier gas HeliumHeliumHeliumHeliumHelium
Substrate
Column diameter (mm) 0.250.250.250.250.25
Phase thickness (μm) 0.250.250.250.250.25
Program not specifiednot specified50 0C 3 0C/min -> 150 0C (10 min) 10 0C/min -> 250 0C40 0C (5 min) 2 0C/min -> 270 0C -> 260 0C (20 min)50 0C (5 min) 2 0C/min -> 100 0C (5 min) 5 0C/min -> 300 0C
I 2131.2152.2175.2120.2173.
ReferenceLiu, Lu, et al., 2011Xu, Tang, et al., 2010Al-Reza, Rahman, et al., 2009Mancini, Arnold, et al., 2009Mebazaa, Mahmoudi, et al., 2009
Comment MSDC-RI MSDC-RI MSDC-RI MSDC-RI MSDC-RI
Column type CapillaryCapillaryCapillaryCapillaryCapillary
Active phase RTX-5 MSHP-1HP-5MSHP-5HP-5
Column length (m) 30.25.30.30.30.
Carrier gas Helium He
Substrate
Column diameter (mm) 0.250.320.250.250.25
Phase thickness (μm) 0.250.170.250.250.25
Program not specifiednot specified40 0C (2 min) 3 0C/min -> 180 0C (2 min) 15 0C -> 280 0C40 0C (2 min) 5 0C/min -> 80 0C 7 oC/min -> 160 0C 9 0C/min -> 200 0C 20 0C/min -> 280 0C (10 min)not specified
I 2161.2098.2112.2146.2141.
ReferenceMebazaa, Mahmoudi, et al., 2009Wetwiayaklung, Thavanapong, et al., 2009Ning, Zheng, et al., 2008Zhao, Li, et al., 2008Zhao, Li, et al., 2008
Comment MSDC-RI MSDC-RI MSDC-RI MSDC-RI MSDC-RI
Column type Capillary
Active phase HP-5MS
Column length (m) 30.
Carrier gas He
Substrate
Column diameter (mm) 0.25
Phase thickness (μm) 0.25
Program 40C(3min) => 2C/min => 180C => 10C/min => 250C(5min)
I 2155.
ReferenceAlissandrakis, Kibaris, et al., 2005
Comment MSDC-RI

Normal alkane RI, polar column, custom temperature program

Data compiled by: NIST Mass Spectrometry Data Center, William E. Wallace, director

Column type CapillaryCapillaryCapillaryCapillary
Active phase InnowaxHP InnowaxDB-FFAPInnowax FSC
Column length (m) 60.50.30.60.
Carrier gas  HeliumHeliumHe
Substrate
Column diameter (mm) 0.250.200.250.25
Phase thickness (μm) 0.330.250.250.25
Program not specified40 0C (5 min) 2 0C/min -> 270 0C -> 260 0C (20 min)not specified60C(10min) => 4C/min => 220C(10min) => 1C/min => 240C
I 3157.3157.3184.3200.
ReferenceNoorizadeh, Farmany, et al., 2011Mancini, Arnold, et al., 2009Mebazaa, Mahmoudi, et al., 2009Baser, Özek, et al., 2004
Comment MSDC-RI MSDC-RI MSDC-RI MSDC-RI

Normal alkane RI, non-polar column, temperature ramp

Data compiled by: NIST Mass Spectrometry Data Center, William E. Wallace, director

Column type CapillaryCapillaryCapillaryCapillaryCapillary
Active phase DP-5DP-5VF-5 MSDB-5 MSHP-5 MS
Column length (m) 30.30.30.30.30.
Carrier gas HeliumHeliumHeliumHeliumHelium
Substrate
Column diameter (mm) 0.250.250.250.250.25
Phase thickness (μm) 0.250.250.250.250.25
Tstart (C) 80.80.40.70.70.
Tend (C) 300.300.250.290.200.
Heat rate (K/min) 4.4.5.5.3.
Initial hold (min) 1.1.3. 2.
Final hold (min) 40.40.3.10.18.
I 2175.2175.2131.2141.2147.
ReferenceVijayakumar, Duraipandiyan, et al., 2012Vijayakumar, Duraipandiyan, et al., 2012Liu, Lu, et al., 2011Stojanovic, RAdulovic, et al., 2011Jerkovic, Hegic, et al., 2010
Comment MSDC-RI MSDC-RI MSDC-RI MSDC-RI MSDC-RI
Column type CapillaryCapillaryCapillaryCapillaryCapillary
Active phase HP-5 MSDB-1HP-5 MSHP-1HP-101
Column length (m) 30.30.30.25.25.
Carrier gas HeliumHeliumHelium Helium
Substrate
Column diameter (mm) 0.250.250.250.320.20
Phase thickness (μm) 0.250.250.250.170.25
Tstart (C) 70.50.70.50.70.
Tend (C) 200.220.290.260.200.
Heat rate (K/min) 3.4.5.1.3.
Initial hold (min) 2.2. 5.2.
Final hold (min) 18.2.10.5.
I 2147.2116.2146.2090.2180.
ReferenceJerkovic, Tuberso, et al., 2010Xu, Tang, et al., 2010Radulovic, Blagojevic, et al., 2009Wetwiayaklung, Thavanapong, et al., 2009Blazevic and Mastelic, 2008
Comment MSDC-RI MSDC-RI MSDC-RI MSDC-RI MSDC-RI
Column type CapillaryCapillaryCapillaryCapillaryCapillary
Active phase HP-101DB-5DB-5DB-5DB-5
Column length (m) 25.30.30.30.30.
Carrier gas HeliumHeHeHeHe
Substrate
Column diameter (mm) 0.200.250.250.250.2
Phase thickness (μm) 0.250.250.250.250.25
Tstart (C) 70.40.40.40.75.
Tend (C) 200.260.260.250.220.
Heat rate (K/min) 3.2.2.2.3.
Initial hold (min) 2.5.5.5.4.
Final hold (min)  20.20.20.
I 2180.2115.2115.2110.2161.
ReferenceBlazevic and Mastelic, 2008Senatore, Landolfi, et al., 2006Senatore, Apostolides Arnold, et al., 2005Senatore, Rigano, et al., 2004Priestap, van Baren, et al., 2003
Comment MSDC-RI MSDC-RI MSDC-RI MSDC-RI MSDC-RI
Column type CapillaryCapillary
Active phase DB-5DB-5
Column length (m) 30.30.
Carrier gas HeHe
Substrate
Column diameter (mm) 0.250.25
Phase thickness (μm) 0.250.25
Tstart (C) 60.60.
Tend (C) 270.270.
Heat rate (K/min) 3.3.
Initial hold (min)
Final hold (min)
I 2112.2115.
ReferencePalmeira, Conserva, et al., 2001Palmeira, Conserva, et al., 2001
Comment MSDC-RI MSDC-RI

References

Rogers, Hoyte, et al., 1978
Rogers, D.W.; Hoyte, O.P.A.; Ho, R.K.C.,
Heats of hydrogenation of large molecules. Part 2. Six unsaturated and polyunsaturated fatty acids,
J. Chem. Soc. Faraday Trans. 1, 1978, 74, 46-52. [all data]
Keffler, 1930
Keffler, L.J.P.,
Calorimetric researches on geometrical isomerism. Part I. Preliminary studies on oleic and elaidic acids and esters from a comparison of their heats of combustion,
J. Phys. Chem., 1930, 34, 1319-1325. [all data]
Mod, Magne, et al., 1962
Mod, R.R.; Magne, F.C.; Skau, E.L.,
J. Chem. Eng. Data, 1962, 7, 31. [all data]
Mod, Magne, et al., 1960
Mod, R.R.; Magne, F.C.; Skau, E.L.,
Pure Acid-Free Amides of C18 Fatty Acids. Their Preparation and Binary Freezing Point Behavior,
J. Chem. Eng. Data, 1960, 5, 478. [all data]
Aldrich Chemical Company Inc., 1990
Aldrich Chemical Company Inc.,
Catalog Handbook of Fine Chemicals, Aldrich Chemical Company, Inc., Milwaukee WI, 1990, 1. [all data]
Stephenson and Malanowski, 1987
Stephenson, Richard M.; Malanowski, Stanislaw,
Handbook of the Thermodynamics of Organic Compounds, 1987, https://doi.org/10.1007/978-94-009-3173-2
. [all data]
Stull, 1947
Stull, Daniel R.,
Vapor Pressure of Pure Substances. Organic and Inorganic Compounds,
Ind. Eng. Chem., 1947, 39, 4, 517-540, https://doi.org/10.1021/ie50448a022
. [all data]
Domalski and Hearing, 1996
Domalski, Eugene S.; Hearing, Elizabeth D.,
Heat Capacities and Entropies of Organic Compounds in the Condensed Phase. Volume III,
J. Phys. Chem. Ref. Data, 1996, 25, 1, 1, https://doi.org/10.1063/1.555985
. [all data]
Sato, Yoshimoto, et al., 1990
Sato, K.; Yoshimoto, N.; Suzuki, M.; Kobayashi, M.; Kaneko, F.,
Structure and transformation in polymorphism of petroselinic acid (cis-w-12-octadecenoic acid),
J. Phys. Chem., 1990, 94, 3180-3185. [all data]