Butylthiobenzene
- Formula: C10H14S
- Molecular weight: 166.283
- IUPAC Standard InChIKey: JETFNRIIPBNRAT-UHFFFAOYSA-N
- CAS Registry Number: 1126-80-3
- Chemical structure:
View 3d structure (requires JavaScript / HTML 5) - Other names: Benzene, (butylthio)-; Sulfide, butyl phenyl; Butyl phenyl sulfide; Phenyl butyl sulfide; (n-Butylthio)benzene; (1-Thiapentyl)benzene; n-Butyl phenyl sulfide; Benzenethiol, S-n-butyl-

Gas phase ion energetics data

Data compiled by: Henry M. Rosenstock, Keith Draxl, Bruce W. Steiner, and John T. Herron
Appearance energy determinations
Ion | AE (eV) | Other Products | Method | Reference | Comment |
---|---|---|---|---|---|
C6H6S+ | 10.33 | ? | EI | Gillis, Long, et al., 1968 |

Kovats' RI, non-polar column, isothermal

Column type | Active phase | Temperature (C) | I | Reference | Comment |
---|---|---|---|---|---|
Packed | Apiezon M | 130. | 1346. | Garbuzov, Misharina, et al., 1985 | He or N2, Chromosorb W, AW-DMCS; Column length: 2.1 m |
Packed | Apiezon M | 130. | 1346. | Golovnya, Garbuzov, et al., 1978 | Chromosorb W, AW/DMS; Column length: 2.1 m |

References

Gillis, Long, et al., 1968
Gillis, R.G.; Long, G.J.; Moritz, A.G.; Occolowitz, J.L.,
Energetics of the electron-impact fragmentation of alkoxybenzenes and alkylthiobenzenes,
Org. Mass Spectrom., 1968, 1, 527. [all data]
Lang (editor), 1966
Lang (editor), L.,
Absorption Spectra in the Ultraviolet and Visible Region, 1966, 17, 33. [all data]
Garbuzov, Misharina, et al., 1985
Garbuzov, V.G.; Misharina, T.A.; Aerov, A.F.; Golovnya, R.V.,
Gas chromatographic retention indices for sulphur(II)-containing organic substances,
J. Anal. Chem. USSR (Engl. Transl.), 1985, 40, 4, 576-586. [all data]
Golovnya, Garbuzov, et al., 1978
Golovnya, R.V.; Garbuzov, V.G.; Aerov, A.F.,
Gas chromatographic characterization of sulfur-containing compounds. 5. Thiophene, furan, and benzene derivatives,
Izv. Akad. Nauk SSSR Ser. Khim., 1978, 11, 2271-2274. [all data]