Benzeneethanamine, N,N-dimethyl-
- Formula: C10H15N
- Molecular weight: 149.2328
- IUPAC Standard InChIKey: TXOFSCODFRHERQ-UHFFFAOYSA-N
- CAS Registry Number: 1126-71-2
- Chemical structure:
View 3d structure (requires JavaScript / HTML 5) - Other names: Phenethylamine, N,N-dimethyl-; Dimethylaminoethylbenzene; N-Phenethyldimethylamine; N,N-Dimethyl-β-phenethylamine; N,N-Dimethylbenzeneethanamine; N,N-Dimethylphenethylamine; N,N-Dimethyl-2-phenethylamine; Benzeneethanamine, dimethyl-; Phenylethylamine, N,N-dimethyl; N,N-Dimethyl-2-phenylethylamine

Phase change data

Data compiled by: Thermodynamics Research Center, NIST Boulder Laboratories, Chris Muzny director
Quantity | Value | Units | Method | Reference | Comment |
---|---|---|---|---|---|
Tboil | 475.65 | K | N/A | Johnson and Guest, 1910 | Uncertainty assigned by TRC = 5. K |

Gas phase ion energetics data

Data compiled as indicated in comments:
LLK - Sharon G. Lias, Rhoda D. Levin, and Sherif A. Kafafi
Ionization energy determinations
IE (eV) | Method | Reference | Comment |
---|---|---|---|
7.70 ± 0.03 | PI | Loguinov, Takhistov, et al., 1981 | LLK |
7.70 ± 0.05 | PE | Akopyan and Loginov, 1974 | LLK |
8.35 ± 0.14 | PE | Domelsmith, Munchausen, et al., 1977 | Vertical value; LLK |
Appearance energy determinations
Ion | AE (eV) | Other Products | Method | Reference | Comment |
---|---|---|---|---|---|
C3H8N+ | 8.17 ± 0.05 | CH2C6H5 | PI | Loguinov, Takhistov, et al., 1981 | LLK |

Kovats' RI, non-polar column, isothermal

Column type | Active phase | Temperature (C) | I | Reference | Comment |
---|---|---|---|---|---|
Packed | Apiezon L | 120. | 1170. | Donike and Stratmann, 1976 | Chromosorb W |

Kovats' RI, polar column, isothermal

Column type | Active phase | Temperature (C) | I | Reference | Comment |
---|---|---|---|---|---|
Packed | PEG-20M | 120. | 1498. | Donike and Stratmann, 1976 | Chromosorb W |

Van Den Dool and Kratz RI, non-polar column, temperature ramp

Column type | Active phase | I | Reference | Comment |
---|---|---|---|---|
Capillary | DB-1 | 1173. | Perrigo, Peel, et al., 1985 | 15. m/0.32 mm/0.25 μm, He, 8. K/min, 280. C @ 5. min; Tstart: 120. C |

Normal alkane RI, non-polar column, custom temperature program

Column type | Active phase | I | Reference | Comment |
---|---|---|---|---|
Other | Methyl Silicone | 1159. | Ardrey and Moffat, 1981 | Program: not specified |

References

Johnson and Guest, 1910
Johnson, T.B.; Guest, H.H.,
J. Am. Chem. Soc., 1910, 32, 761. [all data]
Loguinov, Takhistov, et al., 1981
Loguinov, Y.; Takhistov, V.V.; Vatlina, L.P.,
Photoionization studies of substituted trimethylamines,
Org. Mass Spectrom., 1981, 16, 239. [all data]
Akopyan and Loginov, 1974
Akopyan, M.E.; Loginov, Yu.V.,
Photoelectron spectra of trimethylamine derivatives,
Opt. Spectrosc., 1974, 37, 250, In original 442. [all data]
Domelsmith, Munchausen, et al., 1977
Domelsmith, L.N.; Munchausen, L.L.; Houk, K.N.,
Photoelectron spectra of psychotropic drugs. 1. Phenethylamines, tryptamines, and LSD,
J. Am. Chem. Soc., 1977, 99, 4311. [all data]
Donike and Stratmann, 1976
Donike, M.; Stratmann, D.,
Gas-chromatographische identifizierung von stimulantien der phenyläthylaminreihe mit hilfe der retnetions-indices,
Z. Anal. Chem., 1976, 279, 2, 129-131, https://doi.org/10.1007/BF00440798
. [all data]
Perrigo, Peel, et al., 1985
Perrigo, B.J.; Peel, H.W.; Ballantyne, D.J.,
Use of Dual-Column Fused-Silica Capillary Gas Chromatography in Combination with Detector Response Factors for Analytical Toxicology.,
J. Chromatogr., 1985, 341, 81-88, https://doi.org/10.1016/S0378-4347(00)84011-6
. [all data]
Ardrey and Moffat, 1981
Ardrey, R.E.; Moffat, A.C.,
Gas-liquid chromatographic retention indices of 1318 substances of toxicological interest on SE-30 or OV-1 stationary phase,
J. Chromatogr., 1981, 220, 3, 195-252, https://doi.org/10.1016/S0021-9673(00)81925-1
. [all data]