Benzoic acid, 4-chloro-, methyl ester
- Formula: C8H7ClO2
- Molecular weight: 170.593
- IUPAC Standard InChIKey: LXNFVVDCCWUUKC-UHFFFAOYSA-N
- CAS Registry Number: 1126-46-1
- Chemical structure:
View 3d structure (requires JavaScript / HTML 5) - Other names: Benzoic acid, p-chloro-, methyl ester; Methyl p-chlorobenzoate; Methyl 4-chlorobenzoate; Methyl ester of p-chlorobenzoic acid; 4-Chlorobenzoic acid methyl ester

Gas phase thermochemistry data

Data compiled by: Hussein Y. Afeefy, Joel F. Liebman, and Stephen E. Stein
Quantity | Value | Units | Method | Reference | Comment |
---|---|---|---|---|---|
ΔfH°gas | -305. ± 11. | kJ/mol | Cm | Guthrie, Pike, et al., 1992 | Hydrolysis |

Condensed phase thermochemistry data

Data compiled by: Hussein Y. Afeefy, Joel F. Liebman, and Stephen E. Stein
Quantity | Value | Units | Method | Reference | Comment |
---|---|---|---|---|---|
ΔfH°liquid | -385.3 ± 2.2 | kJ/mol | Cm | Guthrie, Pike, et al., 1992 | Hydrolysis |

Phase change data

Data compiled by: Hussein Y. Afeefy, Joel F. Liebman, and Stephen E. Stein
Quantity | Value | Units | Method | Reference | Comment |
---|---|---|---|---|---|
ΔvapH° | 81. ± 10. | kJ/mol | E | Guthrie, Pike, et al., 1992 | Hydrolysis |

Gas phase ion energetics data

Data evaluated as indicated in comments:
HL - Edward P. Hunter and Sharon G. Lias
Data compiled as indicated in comments:
RDSH - Henry M. Rosenstock, Keith Draxl, Bruce W. Steiner, and John T. Herron
Quantity | Value | Units | Method | Reference | Comment |
---|---|---|---|---|---|
Proton affinity (review) | 842.1 | kJ/mol | N/A | Hunter and Lias, 1998 | HL |
Quantity | Value | Units | Method | Reference | Comment |
Gas basicity | 811.1 | kJ/mol | N/A | Hunter and Lias, 1998 | HL |
Ionization energy determinations
IE (eV) | Method | Reference | Comment |
---|---|---|---|
9.57 | EI | Howe and Williams, 1969 | RDSH |
Appearance energy determinations
Ion | AE (eV) | Other Products | Method | Reference | Comment |
---|---|---|---|---|---|
C7H4OCl+ | 11.02 | CH3O | EI | Howe and Williams, 1969 | RDSH |

Kovats' RI, non-polar column, isothermal

Column type | Active phase | Temperature (C) | I | Reference | Comment |
---|---|---|---|---|---|
Capillary | SE-30 | 160. | 1254. | Korhonen and Lind, 1985 | N2; Column length: 25. m; Column diameter: 0.33 mm |
Capillary | SE-30 | 180. | 1262. | Korhonen and Lind, 1985 | N2; Column length: 25. m; Column diameter: 0.33 mm |
Capillary | SE-30 | 200. | 1275. | Korhonen and Lind, 1985 | N2; Column length: 25. m; Column diameter: 0.33 mm |

Kovats' RI, polar column, isothermal

Column type | Active phase | Temperature (C) | I | Reference | Comment |
---|---|---|---|---|---|
Capillary | OV-351 | 160. | 1849. | Korhonen and Lind, 1985 | N2; Column length: 25. m; Column diameter: 0.32 mm |
Capillary | OV-351 | 180. | 1859. | Korhonen and Lind, 1985 | N2; Column length: 25. m; Column diameter: 0.32 mm |
Capillary | OV-351 | 200. | 1891. | Korhonen and Lind, 1985 | N2; Column length: 25. m; Column diameter: 0.32 mm |

Van Den Dool and Kratz RI, non-polar column, temperature ramp

Column type | Active phase | I | Reference | Comment |
---|---|---|---|---|
Capillary | SE-30 | 1246. | Korhonen and Lind, 1985 | N2, 10. K/min; Column length: 25. m; Column diameter: 0.33 mm; Tstart: 100. C; Tend: 320. C |
Capillary | SE-30 | 1234. | Korhonen and Lind, 1985 | N2, 2. K/min; Column length: 25. m; Column diameter: 0.33 mm; Tstart: 100. C; Tend: 320. C |
Capillary | SE-30 | 1241. | Korhonen and Lind, 1985 | N2, 6. K/min; Column length: 25. m; Column diameter: 0.33 mm; Tstart: 100. C; Tend: 320. C |

Van Den Dool and Kratz RI, polar column, temperature ramp

Column type | Active phase | I | Reference | Comment |
---|---|---|---|---|
Capillary | OV-351 | 1834. | Korhonen and Lind, 1985 | N2, 10. K/min; Column length: 25. m; Column diameter: 0.32 mm; Tstart: 100. C; Tend: 230. C |
Capillary | OV-351 | 1799. | Korhonen and Lind, 1985 | N2, 2. K/min; Column length: 25. m; Column diameter: 0.32 mm; Tstart: 100. C; Tend: 230. C |
Capillary | OV-351 | 1815. | Korhonen and Lind, 1985 | N2, 6. K/min; Column length: 25. m; Column diameter: 0.32 mm; Tstart: 100. C; Tend: 230. C |

References

Guthrie, Pike, et al., 1992
Guthrie, J.P.; Pike, D.C.; Lee, Y.-C.,
Equilibrium constants and heats of formation of methyl esters and N,N-dimethyl amides of substituted benzoic acids,
Can. J. Chem., 1992, 70, 1671-1683. [all data]
Hunter and Lias, 1998
Hunter, E.P.; Lias, S.G.,
Evaluated Gas Phase Basicities and Proton Affinities of Molecules: An Update,
J. Phys. Chem. Ref. Data, 1998, 27, 3, 413-656, https://doi.org/10.1063/1.556018
. [all data]
Howe and Williams, 1969
Howe, I.; Williams, D.H.,
Calculation and qualitative predictions of mass spectra. Mono- and paradisubstituted benzenes,
J. Am. Chem. Soc., 1969, 91, 7137. [all data]
Korhonen and Lind, 1985
Korhonen, I.O.O.; Lind, M.A.,
Gas-liquid chromatographic analyses. XXXV. Capillary column studies of C1-C12 n-alkyl esters of benzoic and monochlorobenzoic acids,
J. Chromatogr., 1985, 322, 83-96, https://doi.org/10.1016/S0021-9673(01)97661-7
. [all data]