Isoquinoline, 3-methyl-
- Formula: C10H9N
- Molecular weight: 143.1852
- IUPAC Standard InChIKey: FVVXWRGARUACNW-UHFFFAOYSA-N
- CAS Registry Number: 1125-80-0
- Chemical structure:
View 3d structure (requires JavaScript / HTML 5) - Other names: 3-Methylisoquinoline

Phase change data

Data compiled as indicated in comments:
BS - Robert L. Brown and Stephen E. Stein
TRC - Thermodynamics Research Center, NIST Boulder Laboratories, Chris Muzny director
Quantity | Value | Units | Method | Reference | Comment |
---|---|---|---|---|---|
Tboil | 519.2 | K | N/A | Weast and Grasselli, 1989 | BS |
Tboil | 526.30 | K | N/A | Zegalska, 1968 | Uncertainty assigned by TRC = 0.23 K; TRC |
Tboil | 519.15 | K | N/A | Cooper, Crowne, et al., 1967 | Uncertainty assigned by TRC = 0.6 K; TRC |
Tboil | 526.28 | K | N/A | Malanowska and Wecsile, 1964 | Uncertainty assigned by TRC = 0.07 K; TRC |
Quantity | Value | Units | Method | Reference | Comment |
Tfus | 336.5 | K | N/A | Zegalska, 1968 | Uncertainty assigned by TRC = 0.2 K; TRC |
Tfus | 336.8 | K | N/A | Malanowska and Wecsile, 1964 | Uncertainty assigned by TRC = 0.3 K; TRC |
Antoine Equation Parameters
log10(P) = A − (B / (T + C))
P = vapor pressure (bar)
T = temperature (K)
View plot Requires a JavaScript / HTML 5 canvas capable browser.
Temperature (K) | A | B | C | Reference | Comment |
---|---|---|---|---|---|
449.46 to 527.74 | 4.07133 | 1699.582 | -108.272 | Malanowska and Wecsile, 1964, 2 | Coefficents calculated by NIST from author's data. |

Gas phase ion energetics data

Data compiled by: Sharon G. Lias, Rhoda D. Levin, and Sherif A. Kafafi
Ionization energy determinations
IE (eV) | Method | Reference |
---|---|---|
8.11 | PE | Schafer, Schweig, et al., 1975 |
7.74 ± 0.02 | PE | Maier, 1974 |

Kovats' RI, non-polar column, isothermal

Column type | Active phase | Temperature (C) | I | Reference | Comment |
---|---|---|---|---|---|
Capillary | OV-101 | 150. | 1313. | Morishita, Morimoto, et al., 1986 | N2; Column length: 20. m; Column diameter: 0.23 mm |

Van Den Dool and Kratz RI, non-polar column, temperature ramp

Column type | Active phase | I | Reference | Comment |
---|---|---|---|---|
Packed | SE-30 | 1322. | Peng, Ding, et al., 1988 | He, Supelcoport and Chromosorb, 40. C @ 4. min, 10. K/min, 250. C @ 60. min; Column length: 3.05 m |

References

Weast and Grasselli, 1989
CRC Handbook of Data on Organic Compounds, 2nd Editon, Weast,R.C and Grasselli, J.G., ed(s)., CRC Press, Inc., Boca Raton, FL, 1989, 1. [all data]
Zegalska, 1968
Zegalska, B.,
Liquid-Solid Equilibria in Binary Systems Formed by Quinoline,
Bull. Acad. Pol. Sci., Ser. Sci. Chim., 1968, 16, 335-41. [all data]
Cooper, Crowne, et al., 1967
Cooper, A.R.; Crowne, C.W.P.; Farrell, P.G.,
Gas-Liquid Chromatographic Studies of Electron-Donor-Acceptor Systems,
Trans. Faraday Soc., 1967, 63, 447. [all data]
Malanowska and Wecsile, 1964
Malanowska, B.; Wecsile, J.,
Vapour pressures and boiling temperatures of some quinoline bases.,
Bull. Acad. Pol. Sci., Ser. Sci. Chim., 1964, 12, 239. [all data]
Malanowska and Wecsile, 1964, 2
Malanowska, B.; Wecsile, J.,
Vapour Pressures and Boiling Temperatures of Some Quinoline Bases,
Bull. Acad. Pol. Sci. Ser. Sci. Chim., 1964, 12, 4, 239-241. [all data]
Schafer, Schweig, et al., 1975
Schafer, W.; Schweig, A.; Vermeer, H.; Bickel-haupt, F.; De Graaf, H.,
On the nature of the "free electron pair" on phosphorus in aromatic phosphorus compounds: the photoelectron spectrum of 2-phosphanaphthalene,
J. Electron Spectrosc. Relat. Phenom., 1975, 6, 91. [all data]
Maier, 1974
Maier, J.P.,
Photoelectron spectroscopy of peri- amino naphthalenes,
Helv. Chim. Acta, 1974, 57, 994. [all data]
Morishita, Morimoto, et al., 1986
Morishita, F.; Morimoto, S.; Kojima, T.,
Prediction of molecular structures of aza-arenes by retention indices and fluorescence spectra,
J. Hi. Res. Chromatogr. Chromatogr. Comm., 1986, 9, 11, 688-692, https://doi.org/10.1002/jhrc.1240091120
. [all data]
Peng, Ding, et al., 1988
Peng, C.T.; Ding, S.F.; Hua, R.L.; Yang, Z.C.,
Prediction of Retention Indexes I. Structure-Retention Index Relationship on Apolar Columns,
J. Chromatogr., 1988, 436, 137-172, https://doi.org/10.1016/S0021-9673(00)94575-8
. [all data]