1,5-Cyclodecadiene, (E,Z)-
- Formula: C10H16
- Molecular weight: 136.2340
- IUPAC Standard InChIKey: RDAFFINKUCJOJK-UYIJSCIWSA-N
- CAS Registry Number: 1124-78-3
- Chemical structure:
View 3d structure (requires JavaScript / HTML 5) - Other names: cis,trans-1,5-Cyclodecadiene; trans,cis-1,5-Cyclodecadiene; 1,5-Cyclodecadiene, (Z,E)-; (E,Z)-1,5-Cyclodecadiene; c,t-cyclodeca-1,5-diene; cyclodeca-1,5-diene

Gas phase ion energetics data

Data compiled by: Henry M. Rosenstock, Keith Draxl, Bruce W. Steiner, and John T. Herron
Ionization energy determinations
IE (eV) | Method | Reference | Comment |
---|---|---|---|
8.90 | PE | Bischof and Heilbronner, 1970 | Vertical value |

Kovats' RI, non-polar column, isothermal

Column type | Active phase | Temperature (C) | I | Reference | Comment |
---|---|---|---|---|---|
Capillary | OV-1 | 100. | 1099.8 | Engewald, Billing, et al., 1987 | Column length: 50. m; Column diameter: 0.3 mm |

References

Bischof and Heilbronner, 1970
Bischof, P.; Heilbronner, E.,
Photoelektron-Spektren von Cycloalkenen und Cycloalkadienen,
Helv. Chim. Acta, 1970, 53, 1677. [all data]
Engewald, Billing, et al., 1987
Engewald, W.; Billing, U.; Welsch, T.; Haufe, G.,
Structure-retention correlations of hydrocarbons in gas-liquid and gas-solid chromatography. Cycloalkenes and cycloalkadienes,
Chromatographia, 1987, 23, 8, 590-594, https://doi.org/10.1007/BF02324870
. [all data]