Diethyl carbitol
- Formula: C8H18O3
- Molecular weight: 162.2267
- IUPAC Standard InChIKey: RRQYJINTUHWNHW-UHFFFAOYSA-N
- CAS Registry Number: 112-36-7
- Chemical structure:
View 3d structure (requires JavaScript / HTML 5) - Other names: Ether, bis(2-ethoxyethyl); Diethylene glycol diethyl ether; Bis(2-ethoxyethyl) ether; Diethyldiethylene glycol; Ethanol, 2,2'-oxybis-, diethyl ether; 2-(2-Ethoxyethoxy)-1-ethoxyethane; 3,6,9-Trioxaundecane; 2-Ethoxyethyl ether; Diethylether diethylenglykolu; 1-Ethoxy-2-(β-ethoxyethoxy)ethane; Ethyl diglyme; Ethane, 1,1'-oxybis[2-ethoxy-

Condensed phase thermochemistry data

Data compiled by: Eugene S. Domalski and Elizabeth D. Hearing
Constant pressure heat capacity of liquid
Cp,liquid (J/mol*K) | Temperature (K) | Reference | Comment |
---|---|---|---|
347.5 | 298.1 | Roux, Perron, et al., 1978 | T = 283 to 313 K. |

Phase change data

Data compiled as indicated in comments:
BS - Robert L. Brown and Stephen E. Stein
TRC - Thermodynamics Research Center, NIST Boulder Laboratories, Chris Muzny director
AC - William E. Acree, Jr., James S. Chickos
ALS - Hussein Y. Afeefy, Joel F. Liebman, and Stephen E. Stein
Quantity | Value | Units | Method | Reference | Comment |
---|---|---|---|---|---|
Tboil | 458.2 | K | N/A | Aldrich Chemical Company Inc., 1990 | BS |
Tboil | 462.15 | K | N/A | Anonymous, 1982 | TRC |
Quantity | Value | Units | Method | Reference | Comment |
Tfus | 228.85 | K | N/A | Anonymous, 1982 | TRC |
Tfus | 228. | K | N/A | Turner, Meador, et al., 1957 | Uncertainty assigned by TRC = 2. K; TRC |
Quantity | Value | Units | Method | Reference | Comment |
ΔvapH° | 56.4 ± 1.4 | kJ/mol | CGC | Nichols, Orf, et al., 2000 | AC |
ΔvapH° | 58.403 ± 0.037 | kJ/mol | C | Kusano and Wadso, 1971 | ALS |
Enthalpy of vaporization
ΔvapH (kJ/mol) | Temperature (K) | Method | Reference | Comment |
---|---|---|---|---|
48.3 | 345. | A | Stephenson and Malanowski, 1987 | Based on data from 330. to 461. K.; AC |
43.18 | 273. | V | Gallaugher and Hibbert, 1937 | ALS |

Reaction thermochemistry data

Data compiled by: Hussein Y. Afeefy, Joel F. Liebman, and Stephen E. Stein
Individual Reactions
By formula: 2H2 + C8H14O3 = C8H18O3
Quantity | Value | Units | Method | Reference | Comment |
---|---|---|---|---|---|
ΔrH° | -224.7 ± 1.8 | kJ/mol | Chyd | Allinger, Glaser, et al., 1981 | liquid phase; solvent: Hexane |

Van Den Dool and Kratz RI, non-polar column, temperature ramp

Column type | Active phase | I | Reference | Comment |
---|---|---|---|---|
Capillary | DB-5 | 1081. | Olson, Wong, et al., 1987 | 30. m/0.32 mm/1.0 μm, 5. K/min; Tstart: 20. C; Tend: 200. C |

Normal alkane RI, non-polar column, temperature ramp

Column type | Active phase | I | Reference | Comment |
---|---|---|---|---|
Capillary | DB-5 | 1081.4 | Olson, Wong, et al., 1988 | 30. m/0.32 mm/1. μm, 5. K/min; Tstart: 20. C; Tend: 200. C |

Normal alkane RI, non-polar column, custom temperature program

Column type | Active phase | I | Reference | Comment |
---|---|---|---|---|
Capillary | SE-30 | 1058. | Vinogradov, 2004 | Program: not specified |

Lee's RI, non-polar column, custom temperature program

Column type | Active phase | I | Reference | Comment |
---|---|---|---|---|
Capillary | Methyl Silicone | 174.83 | Eckel, Ross, et al., 1993 | Program: not specified |
Capillary | Methyl Silicone | 179.46 | Eckel, Ross, et al., 1993 | Program: not specified |

References

Roux, Perron, et al., 1978
Roux, G.; Perron, G.; Desnoyers, J.E.,
The heat capacities and volumes of some low molecular weight amides, ketones, esters, and ethers in water over the whole solubility range,
Can. J. Chem., 1978, 56, 2808-2814. [all data]
Aldrich Chemical Company Inc., 1990
Aldrich Chemical Company Inc.,
Catalog Handbook of Fine Chemicals, Aldrich Chemical Company, Inc., Milwaukee WI, 1990, 1. [all data]
Anonymous, 1982
Anonymous, X.,
Glymes Grant Chemical, 1982, Baton Rouge, LA 1982. [all data]
Turner, Meador, et al., 1957
Turner, R.B.; Meador, W.R.; Doering, W. vonE.; Knox, L.H.; Mayer, J.R.; Wiley, D.W.,
Heats of Hydrogenation III. Hydrogenation of Cyclooctatetraene and of Some Seven-membered Non-benzenoid Aromatic Compounds,
J. Am. Chem. Soc., 1957, 79, 4127. [all data]
Nichols, Orf, et al., 2000
Nichols, Gary; Orf, Jennifer; Reiter, Sarah M.; Chickos, James; Gokel, George W.,
The vaporization enthalpies of some crown and polyethers by correlation gas chromatography,
Thermochimica Acta, 2000, 346, 1-2, 15-28, https://doi.org/10.1016/S0040-6031(99)00405-0
. [all data]
Kusano and Wadso, 1971
Kusano, K.; Wadso, I.,
Enthalpy of vaporization of some organic substances at 25.0°C and test of calorimeter,
Bull. Chem. Soc. Jpn., 1971, 44, 1705-17. [all data]
Stephenson and Malanowski, 1987
Stephenson, Richard M.; Malanowski, Stanislaw,
Handbook of the Thermodynamics of Organic Compounds, 1987, https://doi.org/10.1007/978-94-009-3173-2
. [all data]
Gallaugher and Hibbert, 1937
Gallaugher, A.F.; Hibbert, H.,
Studies on reactions relating to carbohydrates and polysaccharides. LV. Vapor pressures of the polyethylene glycols and their derivatives,
J. Am. Chem. Soc., 1937, 59, 2521-2525. [all data]
Allinger, Glaser, et al., 1981
Allinger, N.L.; Glaser, J.A.; Davis, H.E.,
Heats of hydrogenation of some vinyl ethers and related compounds,
J. Org. Chem., 1981, 46, 658-661. [all data]
Olson, Wong, et al., 1987
Olson, K.L.; Wong, C.A.; Fleck, L.L.; Lazar, D.F.,
Qualitative and Quantitative Determination of Solvent Formulations in Automotive Paints,
J. Chromatogr. Sci., 1987, 25, 9, 418-423, https://doi.org/10.1093/chromsci/25.9.418
. [all data]
Olson, Wong, et al., 1988
Olson, K.L.; Wong, C.A.; Fleck, L.L.; Lazar, D.F.,
Qualitative and quantitative determination of solvent formulations in automotive paints,
J. Coat. Technol., 1988, 60, 762, 45-50. [all data]
Vinogradov, 2004
Vinogradov, B.A.,
Production, composition, properties and application of essential oils, 2004, retrieved from http://viness.narod.ru. [all data]
Eckel, Ross, et al., 1993
Eckel, W.P.; Ross, B.; Isensee, R.K.,
Pentobarbital found in ground water,
Ground Water, 1993, 31, 5, 801-804, https://doi.org/10.1111/j.1745-6584.1993.tb00853.x
. [all data]