1,2-Cyclononadiene
- Formula: C9H14
- Molecular weight: 122.2075
- IUPAC Standard InChIKey: YHGPUHUSTRYSIC-UHFFFAOYSA-N
- CAS Registry Number: 1123-11-1
- Chemical structure:
View 3d structure (requires JavaScript / HTML 5) - Permanent link for this species. Use this link for bookmarking this species for future reference.

Gas phase ion energetics data

Data compiled by: Sharon G. Lias, Rhoda D. Levin, and Sherif A. Kafafi
Ionization energy determinations
IE (eV) | Method | Reference | Comment |
---|---|---|---|
8.87 | PE | Brogli, Crandall, et al., 1973 | Vertical value |

References

Brogli, Crandall, et al., 1973
Brogli, F.; Crandall, J.K.; Heilbronner, E.; Kloster-Jensen, E.; Sojka, S.A.,
The photoelectron spectra of methyl-substituted allenes and of tetramethyl-bisallenyl,
J. Electron Spectrosc. Relat. Phenom., 1973, 2, 455. [all data]