Benzaldehyde, 4-bromo-
- Formula: C7H5BrO
- Molecular weight: 185.018
- IUPAC Standard InChIKey: ZRYZBQLXDKPBDU-UHFFFAOYSA-N
- CAS Registry Number: 1122-91-4
- Chemical structure:
View 3d structure (requires JavaScript / HTML 5) - Other names: p-Bromobenzaldehyde; 4-Bromobenzaldehyde; Benzaldehyde, p-bromo-; 4-Brombenzaldehyd

Phase change data

Data compiled as indicated in comments:
TRC - Thermodynamics Research Center, NIST Boulder Laboratories, Chris Muzny director
AC - William E. Acree, Jr., James S. Chickos
Quantity | Value | Units | Method | Reference | Comment |
---|---|---|---|---|---|
Tfus | 329.15 | K | N/A | Hajos, 1959 | Uncertainty assigned by TRC = 2. K; TRC |
Enthalpy of fusion
ΔfusH (kJ/mol) | Temperature (K) | Reference | Comment |
---|---|---|---|
22.6 | 334.2 | Favareto, Fregadolli, et al., 2008 | AC |

Gas phase ion energetics data

Data compiled as indicated in comments:
LBLHLM - Sharon G. Lias, John E. Bartmess, Joel F. Liebman, John L. Holmes, Rhoda D. Levin, and W. Gary Mallard
Ionization energy determinations
IE (eV) | Method | Reference | Comment |
---|---|---|---|
9.22 | PE | Gal, Geribaldi, et al., 1985 | Vertical value; LBLHLM |

Kovats' RI, non-polar column, isothermal

Column type | Active phase | Temperature (C) | I | Reference | Comment |
---|---|---|---|---|---|
Packed | OV-101 | 140. | 1207.1 | Righezza, Hassani, et al., 1996 | N2, Chromosorb G HP; Column length: 5. m |
Packed | OV-101 | 160. | 1216.5 | Hassani and Meklati, 1992 | N2, Chromosorb G HP; Column length: 5. m |
Packed | SE-30 | 180. | 1229. | Oszczapowicz, Osek, et al., 1985 | N2, Chromosorb A AW; Column length: 3. m |

References

Hajos, 1959
Hajos, A.,
Experiments in the Domain of chloroamphenicols VIII. Preparation of nitroacetophenones and nitrobenzaldehydes and various derivatives through oxidative oxime cleavage,
Acta Chim. Acad. Sci. Hung., 1959, 21, 131. [all data]
Favareto, Fregadolli, et al., 2008
Favareto, Rogério; Fregadolli, Pedro.H.; Cabral, Vladimir F.; Antunes, Octavio A.C.; Cardozo-Filho, L.,
Phase Equilibria of Acrylonitrile and p -Bromobenzaldehyde in Carbon Dioxide,
J. Chem. Eng. Data, 2008, 53, 5, 1080-1084, https://doi.org/10.1021/je700448v
. [all data]
Gal, Geribaldi, et al., 1985
Gal, J.-F.; Geribaldi, S.; Pfister-Guillouzo, G.; Morris, D.G.,
Basicity of the carbonyl group. Part 12. Correlations between ionization potentials and lewis basicities in aromatic carbonyl compounds,
J. Chem. Soc. Perkin Trans. 2, 1985, 103. [all data]
Righezza, Hassani, et al., 1996
Righezza, M.; Hassani, A.; Meklati, B.Y.; Chrétien, J.R.,
Quantitative structure-retention relationships (QSRR) of congeneric aromatics series studied on phenyl OV phases in gas chromatography,
J. Chromatogr. A, 1996, 723, 1, 77-91, https://doi.org/10.1016/0021-9673(95)00816-0
. [all data]
Hassani and Meklati, 1992
Hassani, A.; Meklati, B.Y.,
Gas chromatographic behaviour of monosubstituted benzenes, benzaldehydes and acetophenones on OV polymethylphenyl-silicone stationary phases,
Chromatographia, 1992, 33, 5/6, 267-271, https://doi.org/10.1007/BF02276193
. [all data]
Oszczapowicz, Osek, et al., 1985
Oszczapowicz, J.; Osek, J.; Ciszkowski, K.; Krawczyk, W.; Ostrowski, M.,
Retention Indices of Dimethylbenzamidines and Benzylideneamines on a Non-Polar Column,
J. Chromatogr., 1985, 330, 79-85, https://doi.org/10.1016/S0021-9673(01)81964-6
. [all data]