Ethane, 1,2-bis(2-chloroethoxy)-
- Formula: C6H12Cl2O2
- Molecular weight: 187.064
- IUPAC Standard InChIKey: AGYUOJIYYGGHKV-UHFFFAOYSA-N
- CAS Registry Number: 112-26-5
- Chemical structure:

Normal alkane RI, non-polar column, temperature ramp

Column type | Active phase | I | Reference | Comment |
---|---|---|---|---|
Capillary | HP-5 | 1626. | Mazurek, Witkiewicz, et al., 2001 | He, 40. C @ 3. min, 10. K/min, 280. C @ 30. min; Column length: 30. m; Column diameter: 0.32 mm |

References

Mazurek, Witkiewicz, et al., 2001
Mazurek, M.; Witkiewicz, Z.; Popiel, S.; Sliwakowski, M.,
Capillary gas chromatography-atomic emission spectroscopy-mass spectrometry analysis of sulphur mustard and transformation products in a block recovered from the Baltic Sea,
J. Chromatogr. A, 2001, 919, 1, 133-145, https://doi.org/10.1016/S0021-9673(01)00672-0
. [all data]