4-Pyridinamine, N,N-dimethyl-
- Formula: C7H10N2
- Molecular weight: 122.1677
- IUPAC Standard InChIKey: VHYFNPMBLIVWCW-UHFFFAOYSA-N
- CAS Registry Number: 1122-58-3
- Chemical structure:
View 3d structure (requires JavaScript / HTML 5) - Other names: Pyridine, 4-(dimethylamino)-; γ-(Dimethylamino)pyridine; N,N-Dimethyl-4-aminopyridine; N,N-Dimethyl-4-pyridinamine; 4-(Dimethylamino)pyridine; 4-Dimethylaminepyridine; p-Dimethylaminopyridine; N,N-dimethylpyridin-4-amine

Phase change data

Data compiled by: William E. Acree, Jr., James S. Chickos
Enthalpy of fusion
ΔfusH (kJ/mol) | Temperature (K) | Method | Reference | Comment |
---|---|---|---|---|
21.63 | 387.1 | AC | Shi, Tan, et al., 2007 | Based on data from 80. to 402. K. |

Gas phase ion energetics data

Data evaluated as indicated in comments:
HL - Edward P. Hunter and Sharon G. Lias
Data compiled as indicated in comments:
LLK - Sharon G. Lias, Rhoda D. Levin, and Sherif A. Kafafi
Quantity | Value | Units | Method | Reference | Comment |
---|---|---|---|---|---|
Proton affinity (review) | 997.6 | kJ/mol | N/A | Hunter and Lias, 1998 | HL |
Quantity | Value | Units | Method | Reference | Comment |
Gas basicity | 971.1 | kJ/mol | N/A | Hunter and Lias, 1998 | HL |
Ionization energy determinations
IE (eV) | Method | Reference | Comment |
---|---|---|---|
8.3 ± 0.1 | EI | Stefanovic and Grutzmacher, 1974 | LLK |
7.82 | PE | Ramsey and Walker, 1974 | Vertical value; LLK |

References

Shi, Tan, et al., 2007
Shi, Quan; Tan, Zhi-Cheng; Di, You-Ying; Tong, Bo; Li, Yan-Sheng; Wang, Shao-Xu,
Thermal Analysis and Calorimetric Study of 4-Dimethylaminopyridine,
J. Chem. Eng. Data, 2007, 52, 3, 941-947, https://doi.org/10.1021/je6005423
. [all data]
Hunter and Lias, 1998
Hunter, E.P.; Lias, S.G.,
Evaluated Gas Phase Basicities and Proton Affinities of Molecules: An Update,
J. Phys. Chem. Ref. Data, 1998, 27, 3, 413-656, https://doi.org/10.1063/1.556018
. [all data]
Stefanovic and Grutzmacher, 1974
Stefanovic, D.; Grutzmacher, H.F.,
The ionisation potential of some substituted pyridines,
Org. Mass Spectrom., 1974, 9, 1052. [all data]
Ramsey and Walker, 1974
Ramsey, B.G.; Walker, F.A.,
A linear relationship between substituted pyridine lone pair vertical ionization potentials and pKa,
J. Am. Chem. Soc., 1974, 96, 3314. [all data]