3,5-Cycloheptadien-1-one
- Formula: C7H8O
- Molecular weight: 108.1378
- IUPAC Standard InChIKey: UNELZWLTCBQRGC-UHFFFAOYSA-N
- CAS Registry Number: 1121-65-9
- Chemical structure:
View 3d structure (requires JavaScript / HTML 5) - Permanent link for this species. Use this link for bookmarking this species for future reference.

Gas phase ion energetics data

Data compiled as indicated in comments:
LBLHLM - Sharon G. Lias, John E. Bartmess, Joel F. Liebman, John L. Holmes, Rhoda D. Levin, and W. Gary Mallard
Ionization energy determinations
IE (eV) | Method | Reference | Comment |
---|---|---|---|
8.24 | EI | Russell, Freiser, et al., 1983 | LBLHLM |
Appearance energy determinations
Ion | AE (eV) | Other Products | Method | Reference | Comment |
---|---|---|---|---|---|
C6H7+ | 10.20 | ? | EI | Russell, Freiser, et al., 1983 | LBLHLM |
C7H7O+ | 9.13 | H | EI | Russell, Freiser, et al., 1983 | LBLHLM |

References

Russell, Freiser, et al., 1983
Russell, D.H.; Freiser, B.S.; McBay, E.H.; Canada, D.C.,
The structure of decomposing [C7H7O]+ ions: Benzyl versus tropylium ion structures,
Org. Mass Spectrom., 1983, 18, 474. [all data]