Methanone, dicyclopropyl-
- Formula: C7H10O
- Molecular weight: 110.1537
- IUPAC Standard InChIKey: BIPUHAHGLJKIPK-UHFFFAOYSA-N
- CAS Registry Number: 1121-37-5
- Chemical structure:
View 3d structure (requires JavaScript / HTML 5) - Other names: Cyclopropyl ketone; Dicyclopropyl ketone; Dicyclopropylmethanone

Phase change data

Data compiled by: Robert L. Brown and Stephen E. Stein
Quantity | Value | Units | Method | Reference | Comment |
---|---|---|---|---|---|
Tboil | 434.2 | K | N/A | Weast and Grasselli, 1989 |

Reaction thermochemistry data

Data compiled by: John E. Bartmess
Individual Reactions
C7H9O- + =
By formula: C7H9O- + H+ = C7H10O
Quantity | Value | Units | Method | Reference | Comment |
---|---|---|---|---|---|
ΔrH° | 1569. ± 17. | kJ/mol | G+TS | Brickhouse and Squires, 1988 | gas phase; Between EtOH, EtOAc |
Quantity | Value | Units | Method | Reference | Comment |
ΔrG° | 1540. ± 17. | kJ/mol | IMRB | Brickhouse and Squires, 1988 | gas phase; Between EtOH, EtOAc |

Gas phase ion energetics data

Data evaluated as indicated in comments:
HL - Edward P. Hunter and Sharon G. Lias
Data compiled as indicated in comments:
B - John E. Bartmess
LLK - Sharon G. Lias, Rhoda D. Levin, and Sherif A. Kafafi
Quantity | Value | Units | Method | Reference | Comment |
---|---|---|---|---|---|
Proton affinity (review) | 880.4 | kJ/mol | N/A | Hunter and Lias, 1998 | HL |
Quantity | Value | Units | Method | Reference | Comment |
Gas basicity | 850.6 | kJ/mol | N/A | Hunter and Lias, 1998 | HL |
Ionization energy determinations
IE (eV) | Method | Reference | Comment |
---|---|---|---|
9.1 | PE | Kelder, Cerfontain, et al., 1974 | LLK |
9.28 | PE | Kelder, Cerfontain, et al., 1974 | Vertical value; LLK |
De-protonation reactions
C7H9O- + =
By formula: C7H9O- + H+ = C7H10O
Quantity | Value | Units | Method | Reference | Comment |
---|---|---|---|---|---|
ΔrH° | 1569. ± 17. | kJ/mol | G+TS | Brickhouse and Squires, 1988 | gas phase; Between EtOH, EtOAc; B |
Quantity | Value | Units | Method | Reference | Comment |
ΔrG° | 1540. ± 17. | kJ/mol | IMRB | Brickhouse and Squires, 1988 | gas phase; Between EtOH, EtOAc; B |

References

Weast and Grasselli, 1989
CRC Handbook of Data on Organic Compounds, 2nd Editon, Weast,R.C and Grasselli, J.G., ed(s)., CRC Press, Inc., Boca Raton, FL, 1989, 1. [all data]
Brickhouse and Squires, 1988
Brickhouse, M.D.; Squires, R.R.,
Gas Phase Bronsted vs. Lewis Acid-Base Reactions of 6,6-Dimethylfulvene. A Sensitive Probe of the Electronic Structures of Organic Anions,
J. Am. Chem. Soc., 1988, 110, 9, 2706, https://doi.org/10.1021/ja00217a002
. [all data]
Hunter and Lias, 1998
Hunter, E.P.; Lias, S.G.,
Evaluated Gas Phase Basicities and Proton Affinities of Molecules: An Update,
J. Phys. Chem. Ref. Data, 1998, 27, 3, 413-656, https://doi.org/10.1063/1.556018
. [all data]
Kelder, Cerfontain, et al., 1974
Kelder, J.; Cerfontain, H.; Higginson, B.R.; Lloyd, D.R.,
Photoelectron and ultraviolet absorption spectra of cyclopropyl conjugated 1,2-diketones,
Tetrahedron Lett., 1974, 739. [all data]