2,5-Pyrrolidinedione, 1-methyl-
- Formula: C5H7NO2
- Molecular weight: 113.1146
- IUPAC Standard InChIKey: KYEACNNYFNZCST-UHFFFAOYSA-N
- CAS Registry Number: 1121-07-9
- Chemical structure:
View 3d structure (requires JavaScript / HTML 5) - Other names: Succinimide, N-methyl-; N-Methylsuccinimide; 1-Methyl-2,5-pyrrolidinedione

Gas phase thermochemistry data

Data compiled by: Hussein Y. Afeefy, Joel F. Liebman, and Stephen E. Stein
Quantity | Value | Units | Method | Reference | Comment |
---|---|---|---|---|---|
ΔfH°gas | -389.7 ± 1.6 | kJ/mol | Ccb | Roux, Jimenez, et al., 1997 |

Condensed phase thermochemistry data

Data compiled by: Hussein Y. Afeefy, Joel F. Liebman, and Stephen E. Stein
Quantity | Value | Units | Method | Reference | Comment |
---|---|---|---|---|---|
ΔfH°solid | -469.8 ± 1.6 | kJ/mol | Ccb | Roux, Jimenez, et al., 1997 | |
Quantity | Value | Units | Method | Reference | Comment |
ΔcH°solid | -2498.1 ± 1.5 | kJ/mol | Ccb | Roux, Jimenez, et al., 1997 |

Phase change data

Data compiled as indicated in comments:
BS - Robert L. Brown and Stephen E. Stein
ALS - Hussein Y. Afeefy, Joel F. Liebman, and Stephen E. Stein
AC - William E. Acree, Jr., James S. Chickos
Quantity | Value | Units | Method | Reference | Comment |
---|---|---|---|---|---|
Tboil | 507.2 | K | N/A | Weast and Grasselli, 1989 | BS |
Quantity | Value | Units | Method | Reference | Comment |
ΔsubH° | 80.1 ± 0.3 | kJ/mol | V | Roux, Jimenez, et al., 1997 | ALS |
ΔsubH° | 80.1 ± 0.3 | kJ/mol | N/A | Roux, Jimenez, et al., 1997 | AC |
Reduced pressure boiling point
Tboil (K) | Pressure (bar) | Reference | Comment |
---|---|---|---|
398. to 401. | 0.027 | Frinton Laboratories Inc., 1986 | BS |
Enthalpy of sublimation
ΔsubH (kJ/mol) | Temperature (K) | Method | Reference | Comment |
---|---|---|---|---|
80.6 ± 0.3 | 289. | ME | Roux, Jimenez, et al., 1997 | Based on data from 280. to 298. K.; AC |

Gas phase ion energetics data

Data compiled by: Sharon G. Lias, Rhoda D. Levin, and Sherif A. Kafafi
Ionization energy determinations
IE (eV) | Method | Reference | Comment |
---|---|---|---|
10.71 | PE | Dougherty, Brint, et al., 1978 | Vertical value |

Normal alkane RI, polar column, custom temperature program

Column type | Active phase | I | Reference | Comment |
---|---|---|---|---|
Capillary | Supelcowax 10 | 1910. | Castioni and Kapetanidis, 1996 | 60. m/0.25 mm/0.25 μm, Helium; Program: 60 0C (10 min) 2 0C/min -> 80 0C 3 0C/min -> 100 0C 4 0C/min -> 220 0C (30 min) |

References

Roux, Jimenez, et al., 1997
Roux, M.V.; Jimenez, P.; Martin-Luengo, M.A.; Davalos, J.Z.; Sun, Z.; Hosmane, R.S.; Liebman, J.F.,
The elusive antiaromaticity of Maleimides and maleic anhydride: Enthalpies of formation of N-methylmaleimide, N-methylsuccinimide, N-Methylphtalimide, and N-benzoyl-N-methylbenzamide,
J. Org. Chem., 1997, 62, 2732-2737. [all data]
Weast and Grasselli, 1989
CRC Handbook of Data on Organic Compounds, 2nd Editon, Weast,R.C and Grasselli, J.G., ed(s)., CRC Press, Inc., Boca Raton, FL, 1989, 1. [all data]
Frinton Laboratories Inc., 1986
Frinton Laboratories Inc.,
Catalog Number 11, Frinton Laboratories Inc., Vineland, NJ, 1986, 99. [all data]
Dougherty, Brint, et al., 1978
Dougherty, D.; Brint, P.; McGlynn, S.P.,
Photoelectron spectroscopy of carbonyls. Lone-pair interactions in α-, β-, γ δ-dicarbonyls,
J. Am. Chem. Soc., 1978, 100, 5597. [all data]
Castioni and Kapetanidis, 1996
Castioni, P.; Kapetanidis, I.,
Volatile constituents from Brunfelsia grandiflora ssp. grandiflora: qualitative analysis by GC-MS,
Scientia Pharmaceutica, 1996, 64, 83-91. [all data]