1,3-Dioxane, 4-methyl-
- Formula: C5H10O2
- Molecular weight: 102.1317
- IUPAC Standard InChIKey: INCCMBMMWVKEGJ-UHFFFAOYSA-N
- CAS Registry Number: 1120-97-4
- Chemical structure:
View 3d structure (requires JavaScript / HTML 5) - Other names: m-Dioxane, 4-methyl-; 4-Methyl-m-dioxane; 4-Methyl-1,3-dioxane

Gas phase thermochemistry data

Data compiled as indicated in comments:
DRB - Donald R. Burgess, Jr.
ALS - Hussein Y. Afeefy, Joel F. Liebman, and Stephen E. Stein
Quantity | Value | Units | Method | Reference | Comment |
---|---|---|---|---|---|
ΔfH°gas | -376.9 | kJ/mol | N/A | Pihlaja and Luoma, 1968 | Value computed using ΔfHliquid° value of -416.1±2.9 kj/mol from Pihlaja and Luoma, 1968 and ΔvapH° value of 39.2 kj/mol from Pihlaja and Heikkila, 1967.; DRB |
ΔfH°gas | -378.4 ± 1.9 | kJ/mol | Ccb | Pihlaja and Heikkila, 1967 | ALS |

Condensed phase thermochemistry data

Data compiled by: Hussein Y. Afeefy, Joel F. Liebman, and Stephen E. Stein
Quantity | Value | Units | Method | Reference | Comment |
---|---|---|---|---|---|
ΔfH°liquid | -416.1 ± 2.9 | kJ/mol | Ccb | Pihlaja and Luoma, 1968 | |
ΔfH°liquid | -417.6 ± 0.63 | kJ/mol | Ccb | Pihlaja and Heikkila, 1967 | |
Quantity | Value | Units | Method | Reference | Comment |
ΔcH°liquid | -2980.6 ± 2.9 | kJ/mol | Ccb | Pihlaja and Luoma, 1968 | Corresponding ΔfHºliquid = -416.1 kJ/mol (simple calculation by NIST; no Washburn corrections) |
ΔcH°liquid | -2979.1 ± 0.3 | kJ/mol | Ccb | Pihlaja and Heikkila, 1967 | Corresponding ΔfHºliquid = -417.6 kJ/mol (simple calculation by NIST; no Washburn corrections) |
ΔcH°liquid | -2970. ± 0.8 | kJ/mol | Ccb | Skuratov, Kozina, et al., 1957 | At 20C; Corresponding ΔfHºliquid = -426.8 kJ/mol (simple calculation by NIST; no Washburn corrections) |

Phase change data

Data compiled as indicated in comments:
BS - Robert L. Brown and Stephen E. Stein
TRC - Thermodynamics Research Center, NIST Boulder Laboratories, Chris Muzny director
ALS - Hussein Y. Afeefy, Joel F. Liebman, and Stephen E. Stein
DRB - Donald R. Burgess, Jr.
AC - William E. Acree, Jr., James S. Chickos
Quantity | Value | Units | Method | Reference | Comment |
---|---|---|---|---|---|
Tboil | 387.2 | K | N/A | Weast and Grasselli, 1989 | BS |
Tboil | 383. to 388. | K | N/A | Frinton Laboratories Inc., 1986 | BS |
Tboil | 387.15 | K | N/A | Farberov and Speranskaya, 1958 | Uncertainty assigned by TRC = 1.5 K; TRC |
Quantity | Value | Units | Method | Reference | Comment |
ΔvapH° | 39. ± 1. | kJ/mol | V | Pihlaja and Heikkila, 1967 | ALS |
ΔvapH° | 39.2 | kJ/mol | N/A | Pihlaja and Heikkila, 1967 | DRB |
Enthalpy of vaporization
ΔvapH (kJ/mol) | Temperature (K) | Method | Reference | Comment |
---|---|---|---|---|
43.7 ± 0.3 | 273. to 313. | GS | Verevkin, Peng, et al., 1998 | See also Verevkin, 2002.; AC |

Gas phase ion energetics data

Data compiled as indicated in comments:
LBLHLM - Sharon G. Lias, John E. Bartmess, Joel F. Liebman, John L. Holmes, Rhoda D. Levin, and W. Gary Mallard
Ionization energy determinations
IE (eV) | Method | Reference | Comment |
---|---|---|---|
10.04 | PE | Asfandiarov and Zykov, 1983 | Vertical value; LBLHLM |

Kovats' RI, non-polar column, isothermal

Column type | Active phase | Temperature (C) | I | Reference | Comment |
---|---|---|---|---|---|
Capillary | OV-101 | 130. | 777. | Misharina, Golovnya, et al., 1993 | 50. m/0.32 mm/0.5 μm, He |
Packed | Apiezon L | 120. | 747. | Bogoslovsky, Anvaer, et al., 1978 | Celite 545 |
Packed | Apiezon L | 160. | 772. | Bogoslovsky, Anvaer, et al., 1978 | Celite 545 |

Normal alkane RI, non-polar column, isothermal

Column type | Active phase | Temperature (C) | I | Reference | Comment |
---|---|---|---|---|---|
Packed | Apieson L | 120. | 754. | Kurdina, Markovich, et al., 1969 | not specified, not specified |

Normal alkane RI, non-polar column, custom temperature program

Column type | Active phase | I | Reference | Comment |
---|---|---|---|---|
Capillary | SE-30 | 777. | Vinogradov, 2004 | Program: not specified |

Normal alkane RI, polar column, custom temperature program

Column type | Active phase | I | Reference | Comment |
---|---|---|---|---|
Capillary | Carbowax 20M | 1128. | Vinogradov, 2004 | Program: not specified |

References

Pihlaja and Luoma, 1968
Pihlaja, K.; Luoma, S.,
Heats of formation and conformational energies of 1,3-dioxane and its methyl homologues,
Acta Chem. Scand., 1968, 22, 2401-2414. [all data]
Pihlaja and Heikkila, 1967
Pihlaja, K.; Heikkila, J.,
The configurations of isomeric 2,2,4,6-tetramethyl-1,3-dioxanes,
Acta Chem. Scand., 1967, 21, 2430-2434. [all data]
Skuratov, Kozina, et al., 1957
Skuratov, S.M.; Kozina, M.L.; Shteher, S.M.; Varushyenko, R.M.,
The heats of combustion of several purified compounds,
Thermochem. Bull. (Moscow State Univ.), March, 1957, 36-37. [all data]
Weast and Grasselli, 1989
CRC Handbook of Data on Organic Compounds, 2nd Editon, Weast,R.C and Grasselli, J.G., ed(s)., CRC Press, Inc., Boca Raton, FL, 1989, 1. [all data]
Frinton Laboratories Inc., 1986
Frinton Laboratories Inc.,
Catalog Number 11, Frinton Laboratories Inc., Vineland, NJ, 1986, 99. [all data]
Farberov and Speranskaya, 1958
Farberov, M.I.; Speranskaya, V.A.,
Synthesis of β-Chloro Substituted Alcohols and Their Transformations,
Zh. Obshch. Khim., 1958, 28, 2151. [all data]
Verevkin, Peng, et al., 1998
Verevkin, S.P.; Peng, W.-H.; Beckhaus, H.D.; Rücuardt, C.,
Geminal substituent effects. 16. Does the anomeric effect in ketals depend on the hybridization of the central carbon atom?,
Eur. J. Org. Chem., 1998, 11, 2323. [all data]
Verevkin, 2002
Verevkin, Sergey P.,
Improved Benson Increments for the Estimation of Standard Enthalpies of Formation and Enthalpies of Vaporization of Alkyl Ethers, Acetals, Ketals, and Ortho Esters,
J. Chem. Eng. Data, 2002, 47, 5, 1071-1097, https://doi.org/10.1021/je020023o
. [all data]
Asfandiarov and Zykov, 1983
Asfandiarov, N.L.; Zykov, B.G.,
Photoelectron spectra of methyl-substituted 1,3-Dioxanes,
Bull. Acad. Sci. USSR, Div. Chem. Sci., 1983, 10, 2069, In original 2293. [all data]
Misharina, Golovnya, et al., 1993
Misharina, T.A.; Golovnya, R.V.; Beletsky, I.V.,
Sorption properties of heterocyclic compounds differing by heteroatom in capillary gas chromatography,
Russ. Chem. Bull. (Engl. Transl.), 1993, 42, 7, 1167-1170, https://doi.org/10.1007/BF00701998
. [all data]
Bogoslovsky, Anvaer, et al., 1978
Bogoslovsky, Yu.N.; Anvaer, B.I.; Vigdergauz, M.S.,
Chromatographic constants in gas chromatography (in Russian), Standards Publ. House, Moscow, 1978, 192. [all data]
Kurdina, Markovich, et al., 1969
Kurdina, Z.G.; Markovich, V.E.; Sakharov, V.M.,
Gas chromatography of cyclic O-containing compounds
in Gas chromatography, Issue # 10, NIITEKhim, Moscow, 1969, 128-133. [all data]
Vinogradov, 2004
Vinogradov, B.A.,
Production, composition, properties and application of essential oils, 2004, retrieved from http://viness.narod.ru. [all data]