5,7-Dodecadiyne
- Formula: C12H18
- Molecular weight: 162.2713
- IUPAC Standard InChIKey: KSOQHQONAHQOCM-UHFFFAOYSA-N
- CAS Registry Number: 1120-29-2
- Chemical structure:
View 3d structure (requires JavaScript / HTML 5) - Permanent link for this species. Use this link for bookmarking this species for future reference.

Phase change data

Data compiled by: Robert L. Brown and Stephen E. Stein
Reduced pressure boiling point
Tboil (K) | Pressure (bar) | Reference |
---|---|---|
393.2 | 0.017 | Aldrich Chemical Company Inc., 1990 |

Reaction thermochemistry data

Data compiled by: Hussein Y. Afeefy, Joel F. Liebman, and Stephen E. Stein
Individual Reactions
By formula: C12H18 + 4H2 = C12H26
Quantity | Value | Units | Method | Reference | Comment |
---|---|---|---|---|---|
ΔrH° | -532. ± 3. | kJ/mol | Chyd | Flitcroft, Skinner, et al., 1957 | liquid phase |

Gas phase ion energetics data

Data compiled by: Sharon G. Lias, Rhoda D. Levin, and Sherif A. Kafafi
Ionization energy determinations
IE (eV) | Method | Reference |
---|---|---|
8.67 | PE | Heilbronner, Jones, et al., 1977 |

References

Aldrich Chemical Company Inc., 1990
Aldrich Chemical Company Inc.,
Catalog Handbook of Fine Chemicals, Aldrich Chemical Company, Inc., Milwaukee WI, 1990, 1. [all data]
Flitcroft, Skinner, et al., 1957
Flitcroft, T.; Skinner, H.A.; Whiting, M.C.,
Heats of hydrogenation Part 1.-Dodeca-3:9 and -5:7 Diynes,
Trans. Faraday Soc., 1957, 53, 784-790. [all data]
Heilbronner, Jones, et al., 1977
Heilbronner, E.; Jones, T.B.; Maier, J.P.,
170. The ionization energies of di-n-alkyl diacetylenes,
Helv. Chim. Acta, 1977, 60, 1697. [all data]