Ethane, 1,1'-oxybis[2-methoxy-
- Formula: C6H14O3
- Molecular weight: 134.1736
- IUPAC Standard InChIKey: SBZXBUIDTXKZTM-UHFFFAOYSA-N
- CAS Registry Number: 111-96-6
- Chemical structure:
View 3d structure (requires JavaScript / HTML 5) - Other names: Ether, bis(2-methoxyethyl); (2-Methoxyethyl) ether; Bis(2-methoxyethyl) ether; Di(2-Methoxyethyl) ether; Diethylene glycol dimethyl ether; Diglyme; Dimethyl carbitol; Ethanol, 2,2'-oxybis-, dimethyl ether; Glyme-2; Poly-Solv; 2-(2-Methoxyethoxy)-1-methoxyethane; 2,5,8-Trioxanonane; CH3OCH2CH2OCH2CH2OCH3; Dimethoxydiethylene glycol; Dimethyldigol; Diethyl glycol dimethyl ether; 1,1'-Oxybis(2-methoxy)ethane; 2,2'-Oxybisethanol dimethyl ether; Diglycol methyl ether; NSC 59726; Methyl diglyme; diglyme (diethylene glycol dimethyl ether)

Gas phase thermochemistry data

Data compiled as indicated in comments:
DRB - Donald R. Burgess, Jr.
Quantity | Value | Units | Method | Reference | Comment |
---|---|---|---|---|---|
ΔfH°gas | -521.3 | kJ/mol | Semi | Stewart, 2004 | |
ΔfH°gas | -511.7 | kJ/mol | N/A | Gutner, Lebedeva, et al., 1980 | Value computed using ΔfHliquid° value of -556.4±0.9 kj/mol from Gutner, Lebedeva, et al., 1980 and ΔvapH° value of 44.7 kj/mol from Mansson, 1969.; DRB |
ΔfH°gas | -524.7 | kJ/mol | N/A | Baroody and Carpenter, 1972 | Value computed using ΔfHliquid° value of -569.4 kj/mol from Baroody and Carpenter, 1972 and ΔvapH° value of 44.7 kj/mol from Mansson, 1969.; DRB |

Condensed phase thermochemistry data

Data compiled as indicated in comments:
ALS - Hussein Y. Afeefy, Joel F. Liebman, and Stephen E. Stein
DH - Eugene S. Domalski and Elizabeth D. Hearing
Quantity | Value | Units | Method | Reference | Comment |
---|---|---|---|---|---|
ΔfH°liquid | -556.4 ± 0.9 | kJ/mol | Ccb | Gutner, Lebedeva, et al., 1980 | ALS |
ΔfH°liquid | -569.4 | kJ/mol | Ccb | Baroody and Carpenter, 1972 | ALS |
Quantity | Value | Units | Method | Reference | Comment |
ΔcH°liquid | -3805.5 ± 0.9 | kJ/mol | Ccb | Gutner, Lebedeva, et al., 1980 | Corresponding ΔfHºliquid = -556.4 kJ/mol (simple calculation by NIST; no Washburn corrections); ALS |
Quantity | Value | Units | Method | Reference | Comment |
S°liquid | 352.7 | J/mol*K | N/A | Beaumont, Clegg, et al., 1966 | Extrapolation below 90 K, 79.91 J/mol*K.; DH |
Constant pressure heat capacity of liquid
Cp,liquid (J/mol*K) | Temperature (K) | Reference | Comment |
---|---|---|---|
277.76 | 298.15 | Trejo, Costas, et al., 1991 | DH |
279.84 | 298.15 | Villamanan, Casanova, et al., 1982 | DH |
274.1 | 298.15 | Beaumont, Clegg, et al., 1966 | T = 90 to 350 K.; DH |

Phase change data

Data compiled as indicated in comments:
BS - Robert L. Brown and Stephen E. Stein
TRC - Thermodynamics Research Center, NIST Boulder Laboratories, Chris Muzny director
AC - William E. Acree, Jr., James S. Chickos
DRB - Donald R. Burgess, Jr.
DH - Eugene S. Domalski and Elizabeth D. Hearing
Quantity | Value | Units | Method | Reference | Comment |
---|---|---|---|---|---|
Tboil | 435.2 | K | N/A | Weast and Grasselli, 1989 | BS |
Tboil | 435.15 | K | N/A | Anonymous, 1982 | TRC |
Tboil | 435. | K | N/A | Wallace and Mathews, 1964 | Uncertainty assigned by TRC = 4. K; TRC |
Quantity | Value | Units | Method | Reference | Comment |
Tfus | 209.15 | K | N/A | Anonymous, 1982 | TRC |
Tfus | 209.1 | K | N/A | Beaumont, Clegg, et al., 1966, 2 | Uncertainty assigned by TRC = 0.2 K; TRC |
Quantity | Value | Units | Method | Reference | Comment |
ΔvapH° | 48.0 ± 0.6 | kJ/mol | CGC | Nichols, Orf, et al., 2000 | AC |
ΔvapH° | 44.7 | kJ/mol | N/A | Mansson, 1969 | DRB |
Enthalpy of vaporization
ΔvapH (kJ/mol) | Temperature (K) | Method | Reference | Comment |
---|---|---|---|---|
45.4 | 371. to 434. | EB | Li, Fang, et al., 2009 | AC |
47.4 | 301. | A | Stephenson and Malanowski, 1987 | Based on data from 286. to 433. K. See also Stull, 1947.; AC |
Antoine Equation Parameters
log10(P) = A − (B / (T + C))
P = vapor pressure (bar)
T = temperature (K)
View plot Requires a JavaScript / HTML 5 canvas capable browser.
Temperature (K) | A | B | C | Reference | Comment |
---|---|---|---|---|---|
286. to 433.0 | 4.87223 | 1922.137 | -38.063 | Stull, 1947 | Coefficents calculated by NIST from author's data. |
Enthalpy of fusion
ΔfusH (kJ/mol) | Temperature (K) | Reference | Comment |
---|---|---|---|
17.78 | 209.1 | Domalski and Hearing, 1996 | AC |
17.795 | 209.1 | Beaumont, Clegg, et al., 1966 | DH |
Entropy of fusion
ΔfusS (J/mol*K) | Temperature (K) | Reference | Comment |
---|---|---|---|
85.1 | 209.1 | Beaumont, Clegg, et al., 1966 | DH |

Reaction thermochemistry data

Data compiled as indicated in comments:
B - John E. Bartmess
M - Michael M. Meot-Ner (Mautner) and Sharon G. Lias
Individual Reactions
By formula: C2H3O2- + C6H14O3 = (C2H3O2- • C6H14O3)
Quantity | Value | Units | Method | Reference | Comment |
---|---|---|---|---|---|
ΔrH° | 63.2 ± 4.2 | kJ/mol | N/A | Meot-Ner and Sieck, 1986 | gas phase; B,M |
Quantity | Value | Units | Method | Reference | Comment |
ΔrS° | 77.4 | J/mol*K | PHPMS | Meot-Ner and Sieck, 1986 | gas phase; M |
Quantity | Value | Units | Method | Reference | Comment |
ΔrG° | 40. ± 6.7 | kJ/mol | TDAs | Meot-Ner and Sieck, 1986 | gas phase; B |
(C6H15O3+ • ) +
= (C6H15O3+ •
•
)
By formula: (C6H15O3+ • H3N) + C6H14O3 = (C6H15O3+ • C6H14O3 • H3N)
Bond type: Hydrogen bonds between protonated and neutral organics
Quantity | Value | Units | Method | Reference | Comment |
---|---|---|---|---|---|
ΔrH° | 128. | kJ/mol | PHPMS | Meot-Ner (Mautner), Sieck, et al., 1996 | gas phase; M |
Quantity | Value | Units | Method | Reference | Comment |
ΔrS° | 213. | J/mol*K | PHPMS | Meot-Ner (Mautner), Sieck, et al., 1996 | gas phase; M |
By formula: C3H10N+ + C6H14O3 = (C3H10N+ • C6H14O3)
Bond type: Hydrogen bonds with polydentate bonding in positive ions
Quantity | Value | Units | Method | Reference | Comment |
---|---|---|---|---|---|
ΔrH° | 137. | kJ/mol | PHPMS | Meot-Ner (Mautner), 1983 | gas phase; diglyme; M |
Quantity | Value | Units | Method | Reference | Comment |
ΔrS° | 167. | J/mol*K | PHPMS | Meot-Ner (Mautner), 1983 | gas phase; diglyme; M |
By formula: C4H5N2+ + C6H14O3 = (C4H5N2+ • C6H14O3)
Bond type: Hydrogen bonds with polydentate bonding in positive ions
Quantity | Value | Units | Method | Reference | Comment |
---|---|---|---|---|---|
ΔrH° | 136. | kJ/mol | PHPMS | Meot-Ner (Mautner), 1983 | gas phase; diglyme; M |
Quantity | Value | Units | Method | Reference | Comment |
ΔrS° | 151. | J/mol*K | PHPMS | Meot-Ner (Mautner), 1983 | gas phase; diglyme; M |
By formula: C5H5FN+ + C6H14O3 = (C5H5FN+ • C6H14O3)
Bond type: Hydrogen bonds with polydentate bonding in positive ions
Quantity | Value | Units | Method | Reference | Comment |
---|---|---|---|---|---|
ΔrH° | 145. | kJ/mol | PHPMS | Meot-Ner (Mautner), 1983 | gas phase; diglyme; M |
Quantity | Value | Units | Method | Reference | Comment |
ΔrS° | 162. | J/mol*K | PHPMS | Meot-Ner (Mautner), 1983 | gas phase; diglyme; M |
By formula: C5H6N+ + C6H14O3 = (C5H6N+ • C6H14O3)
Bond type: Hydrogen bonds with polydentate bonding in positive ions
Quantity | Value | Units | Method | Reference | Comment |
---|---|---|---|---|---|
ΔrH° | 132. | kJ/mol | PHPMS | Meot-Ner (Mautner), 1983 | gas phase; diglyme; M |
Quantity | Value | Units | Method | Reference | Comment |
ΔrS° | 153. | J/mol*K | PHPMS | Meot-Ner (Mautner), 1983 | gas phase; diglyme; M |
By formula: C6H14N+ + C6H14O3 = (C6H14N+ • C6H14O3)
Bond type: Hydrogen bonds with polydentate bonding in positive ions
Quantity | Value | Units | Method | Reference | Comment |
---|---|---|---|---|---|
ΔrH° | 166. | kJ/mol | PHPMS | Meot-Ner (Mautner), 1983 | gas phase; diglyme; M |
Quantity | Value | Units | Method | Reference | Comment |
ΔrS° | 187. | J/mol*K | PHPMS | Meot-Ner (Mautner), 1983 | gas phase; diglyme; M |
(C6H15O3+ • ) +
= (C6H15O3+ •
•
)
By formula: (C6H15O3+ • C6H14O3) + H2O = (C6H15O3+ • H2O • C6H14O3)
Bond type: Hydrogen bond (positive ion to hydride)
Quantity | Value | Units | Method | Reference | Comment |
---|---|---|---|---|---|
ΔrH° | 86.2 | kJ/mol | PHPMS | Meot-Ner (Mautner), Sieck, et al., 1994 | gas phase; M |
Quantity | Value | Units | Method | Reference | Comment |
ΔrS° | 145. | J/mol*K | PHPMS | Meot-Ner (Mautner), Sieck, et al., 1994 | gas phase; M |
By formula: C6H15O3+ + C6H14O3 = (C6H15O3+ • C6H14O3)
Bond type: Hydrogen bonds between protonated and neutral organics
Quantity | Value | Units | Method | Reference | Comment |
---|---|---|---|---|---|
ΔrH° | 89.1 | kJ/mol | PHPMS | Meot-Ner (Mautner), Sieck, et al., 1994 | gas phase; M |
Quantity | Value | Units | Method | Reference | Comment |
ΔrS° | 159. | J/mol*K | PHPMS | Meot-Ner (Mautner), Sieck, et al., 1994 | gas phase; M |

Gas phase ion energetics data

Data evaluated as indicated in comments:
HL - Edward P. Hunter and Sharon G. Lias
Data compiled as indicated in comments:
LBLHLM - Sharon G. Lias, John E. Bartmess, Joel F. Liebman, John L. Holmes, Rhoda D. Levin, and W. Gary Mallard
Quantity | Value | Units | Method | Reference | Comment |
---|---|---|---|---|---|
Proton affinity (review) | 918.8 | kJ/mol | N/A | Hunter and Lias, 1998 | HL |
Quantity | Value | Units | Method | Reference | Comment |
Gas basicity | 870.9 | kJ/mol | N/A | Hunter and Lias, 1998 | HL |
Ionization energy determinations
IE (eV) | Method | Reference | Comment |
---|---|---|---|
9.8 | PE | Baker, Armen, et al., 1983 | Vertical value; LBLHLM |

Ion clustering data

Data compiled as indicated in comments:
B - John E. Bartmess
M - Michael M. Meot-Ner (Mautner) and Sharon G. Lias
Clustering reactions
By formula: C2H3O2- + C6H14O3 = (C2H3O2- • C6H14O3)
Quantity | Value | Units | Method | Reference | Comment |
---|---|---|---|---|---|
ΔrH° | 63.2 ± 4.2 | kJ/mol | N/A | Meot-Ner and Sieck, 1986 | gas phase; B,M |
Quantity | Value | Units | Method | Reference | Comment |
ΔrS° | 77.4 | J/mol*K | PHPMS | Meot-Ner and Sieck, 1986 | gas phase; M |
Quantity | Value | Units | Method | Reference | Comment |
ΔrG° | 40. ± 6.7 | kJ/mol | TDAs | Meot-Ner and Sieck, 1986 | gas phase; B |
By formula: C3H10N+ + C6H14O3 = (C3H10N+ • C6H14O3)
Bond type: Hydrogen bonds with polydentate bonding in positive ions
Quantity | Value | Units | Method | Reference | Comment |
---|---|---|---|---|---|
ΔrH° | 137. | kJ/mol | PHPMS | Meot-Ner (Mautner), 1983 | gas phase; diglyme; M |
Quantity | Value | Units | Method | Reference | Comment |
ΔrS° | 167. | J/mol*K | PHPMS | Meot-Ner (Mautner), 1983 | gas phase; diglyme; M |
By formula: C4H5N2+ + C6H14O3 = (C4H5N2+ • C6H14O3)
Bond type: Hydrogen bonds with polydentate bonding in positive ions
Quantity | Value | Units | Method | Reference | Comment |
---|---|---|---|---|---|
ΔrH° | 136. | kJ/mol | PHPMS | Meot-Ner (Mautner), 1983 | gas phase; diglyme; M |
Quantity | Value | Units | Method | Reference | Comment |
ΔrS° | 151. | J/mol*K | PHPMS | Meot-Ner (Mautner), 1983 | gas phase; diglyme; M |
By formula: C5H5FN+ + C6H14O3 = (C5H5FN+ • C6H14O3)
Bond type: Hydrogen bonds with polydentate bonding in positive ions
Quantity | Value | Units | Method | Reference | Comment |
---|---|---|---|---|---|
ΔrH° | 145. | kJ/mol | PHPMS | Meot-Ner (Mautner), 1983 | gas phase; diglyme; M |
Quantity | Value | Units | Method | Reference | Comment |
ΔrS° | 162. | J/mol*K | PHPMS | Meot-Ner (Mautner), 1983 | gas phase; diglyme; M |
By formula: C5H6N+ + C6H14O3 = (C5H6N+ • C6H14O3)
Bond type: Hydrogen bonds with polydentate bonding in positive ions
Quantity | Value | Units | Method | Reference | Comment |
---|---|---|---|---|---|
ΔrH° | 132. | kJ/mol | PHPMS | Meot-Ner (Mautner), 1983 | gas phase; diglyme; M |
Quantity | Value | Units | Method | Reference | Comment |
ΔrS° | 153. | J/mol*K | PHPMS | Meot-Ner (Mautner), 1983 | gas phase; diglyme; M |
By formula: C6H14N+ + C6H14O3 = (C6H14N+ • C6H14O3)
Bond type: Hydrogen bonds with polydentate bonding in positive ions
Quantity | Value | Units | Method | Reference | Comment |
---|---|---|---|---|---|
ΔrH° | 166. | kJ/mol | PHPMS | Meot-Ner (Mautner), 1983 | gas phase; diglyme; M |
Quantity | Value | Units | Method | Reference | Comment |
ΔrS° | 187. | J/mol*K | PHPMS | Meot-Ner (Mautner), 1983 | gas phase; diglyme; M |
By formula: C6H15O3+ + C6H14O3 = (C6H15O3+ • C6H14O3)
Bond type: Hydrogen bonds between protonated and neutral organics
Quantity | Value | Units | Method | Reference | Comment |
---|---|---|---|---|---|
ΔrH° | 89.1 | kJ/mol | PHPMS | Meot-Ner (Mautner), Sieck, et al., 1994 | gas phase; M |
Quantity | Value | Units | Method | Reference | Comment |
ΔrS° | 159. | J/mol*K | PHPMS | Meot-Ner (Mautner), Sieck, et al., 1994 | gas phase; M |
(C6H15O3+ • ) +
= (C6H15O3+ •
•
)
By formula: (C6H15O3+ • H3N) + C6H14O3 = (C6H15O3+ • C6H14O3 • H3N)
Bond type: Hydrogen bonds between protonated and neutral organics
Quantity | Value | Units | Method | Reference | Comment |
---|---|---|---|---|---|
ΔrH° | 128. | kJ/mol | PHPMS | Meot-Ner (Mautner), Sieck, et al., 1996 | gas phase; M |
Quantity | Value | Units | Method | Reference | Comment |
ΔrS° | 213. | J/mol*K | PHPMS | Meot-Ner (Mautner), Sieck, et al., 1996 | gas phase; M |

Van Den Dool and Kratz RI, non-polar column, temperature ramp

Column type | Active phase | I | Reference | Comment |
---|---|---|---|---|
Capillary | DB-5 | 951. | Olson, Wong, et al., 1987 | 30. m/0.32 mm/1.0 μm, 5. K/min; Tstart: 20. C; Tend: 200. C |

Normal alkane RI, non-polar column, temperature ramp

Column type | Active phase | I | Reference | Comment |
---|---|---|---|---|
Capillary | DB-5 | 950.9 | Olson, Wong, et al., 1988 | 30. m/0.32 mm/1. μm, 5. K/min; Tstart: 20. C; Tend: 200. C |

References

Stewart, 2004
Stewart, J.J.P.,
Comparison of the accuracy of semiempirical and some DFT methods for predicting heats of formation,
J. Mol. Model, 2004, 10, 1, 6-10, https://doi.org/10.1007/s00894-003-0157-6
. [all data]
Gutner, Lebedeva, et al., 1980
Gutner, N.M.; Lebedeva, N.D.; Dobychin, S.L.; Kiseleva, N.N.,
Thermochemical study of aliphatic ethers,
J. Appl. Chem. USSR, 1980, 53, 1523-1525. [all data]
Mansson, 1969
Mansson, M.,
Non-bonded oxygen-oxygen interactions in straight-chain compounds,
J. Chem. Thermodyn., 1969, 1, 141-151. [all data]
Baroody and Carpenter, 1972
Baroody, E.E.; Carpenter, G.A.,
Heats of formation of propellant compounds (U), Rpt. Naval Ordnance Systems Command Task No. 331-003/067-1/UR2402-001 for Naval Ordance Station, Indian Head, MD, 1972, 1-9. [all data]
Beaumont, Clegg, et al., 1966
Beaumont, R.H.; Clegg, B.; Gee, G.; Herbert, J.B.M.; Marks, D.J.; Roberts, R.C.; Sims, D.,
Heat capacities of propylene oxide and of some polymers of ethylene and propylene oxides,
Polymer, 1966, 7, 401-416. [all data]
Trejo, Costas, et al., 1991
Trejo, L.M.; Costas, M.; Patterson, D.,
Excess heat capacity of organic mixtures, Internat. DATA Series,
Selected Data Mixt., 1991, Ser. [all data]
Villamanan, Casanova, et al., 1982
Villamanan, M.A.; Casanova, C.; Roux-Desgranges, G.; Grolier, J.-P.E.,
Thermochemical behavior of mixtures of n-alcohol + aliphatic ether: heat capacities and volumes at 298.15 K,
Thermochim. Acta, 1982, 52, 279-283. [all data]
Weast and Grasselli, 1989
CRC Handbook of Data on Organic Compounds, 2nd Editon, Weast,R.C and Grasselli, J.G., ed(s)., CRC Press, Inc., Boca Raton, FL, 1989, 1. [all data]
Anonymous, 1982
Anonymous, X.,
Glymes Grant Chemical, 1982, Baton Rouge, LA 1982. [all data]
Wallace and Mathews, 1964
Wallace, W.J.; Mathews, A.L.,
Density, Refractive Indices, Molar Refractions, and Viscosities of Diethylene Glycol Dimethyl Ether-Water Solutions at 25 C,
J. Chem. Eng. Data, 1964, 9, 267-268. [all data]
Beaumont, Clegg, et al., 1966, 2
Beaumont, R.H.; Clegg, B.; Gee, G.; Herbert, J.B.M.; Marks, D.J.; Roberts, R.C.; Sims, D.,
Heat Capacities of Propylene Oxide and of Some Polymers of Ethylene and Propylene Oxides,
Polymer, 1966, 7, 401. [all data]
Nichols, Orf, et al., 2000
Nichols, Gary; Orf, Jennifer; Reiter, Sarah M.; Chickos, James; Gokel, George W.,
The vaporization enthalpies of some crown and polyethers by correlation gas chromatography,
Thermochimica Acta, 2000, 346, 1-2, 15-28, https://doi.org/10.1016/S0040-6031(99)00405-0
. [all data]
Li, Fang, et al., 2009
Li, Dan; Fang, Wenjun; Xie, Wenjie; Xing, Yan; Guo, Yongsheng; Lin, Ruisen,
Measurements on Vapor Pressure and Thermal Conductivity for Pseudo-binary Systems of a Hydrocarbon Fuel with Ethylene and Diethylene Glycol Dimethyl Ethers,
Energy Fuels, 2009, 23, 2, 794-798, https://doi.org/10.1021/ef8007163
. [all data]
Stephenson and Malanowski, 1987
Stephenson, Richard M.; Malanowski, Stanislaw,
Handbook of the Thermodynamics of Organic Compounds, 1987, https://doi.org/10.1007/978-94-009-3173-2
. [all data]
Stull, 1947
Stull, Daniel R.,
Vapor Pressure of Pure Substances. Organic and Inorganic Compounds,
Ind. Eng. Chem., 1947, 39, 4, 517-540, https://doi.org/10.1021/ie50448a022
. [all data]
Domalski and Hearing, 1996
Domalski, Eugene S.; Hearing, Elizabeth D.,
Heat Capacities and Entropies of Organic Compounds in the Condensed Phase. Volume III,
J. Phys. Chem. Ref. Data, 1996, 25, 1, 1, https://doi.org/10.1063/1.555985
. [all data]
Meot-Ner and Sieck, 1986
Meot-Ner, M.; Sieck, L.W.,
The ionic hydrogen bond and ion solvation. 5. OH...O- bonds. Gas phase solvation and clustering of alkoxide and carboxylate anions,
J. Am. Chem. Soc., 1986, 108, 7525. [all data]
Meot-Ner (Mautner), Sieck, et al., 1996
Meot-Ner (Mautner), M.; Sieck, L.W.; Liebman, J.F.; Scheiner, S.,
Complexing of the Ammonium Ion by Polyethers. Comparative Complexing Thermochemistry of Ammonium, Hydronium, and Alkali Cations,
J. Phys. Chem., 1996, 100, 16, 6445, https://doi.org/10.1021/jp9514943
. [all data]
Meot-Ner (Mautner), 1983
Meot-Ner (Mautner), M.,
The Ionic Hydrogen Bond. 3. Multiple and -CH+...O- Bonds. Complexes of Ammonium Ions with Polyethers and Crown Ethers,
J. Am. Chem. Soc., 1983, 105, 15, 4912, https://doi.org/10.1021/ja00353a012
. [all data]
Meot-Ner (Mautner), Sieck, et al., 1994
Meot-Ner (Mautner), M.; Sieck, L.W.; Liebman, J.F.; Scheiner, S.; Duan, X.,
The Ionic Hydrogen Bond. 5. Polydentate and Solvent-Bridged Structures. Complexing of the Proton and the Hydronium Ions by Polyethers,
J. Am. Chem. Soc., 1994, 116, 17, 7848, https://doi.org/10.1021/ja00096a047
. [all data]
Hunter and Lias, 1998
Hunter, E.P.; Lias, S.G.,
Evaluated Gas Phase Basicities and Proton Affinities of Molecules: An Update,
J. Phys. Chem. Ref. Data, 1998, 27, 3, 413-656, https://doi.org/10.1063/1.556018
. [all data]
Baker, Armen, et al., 1983
Baker, A.D.; Armen, G.H.; Funaro, S.,
Oral levels of crown ethers and related macrocycles studies by ultraviolet photoelectron spectroscopy: Relationship to complexation studies,
J. Chem. Soc. Dalton Trans., 1983, 2519. [all data]
Olson, Wong, et al., 1987
Olson, K.L.; Wong, C.A.; Fleck, L.L.; Lazar, D.F.,
Qualitative and Quantitative Determination of Solvent Formulations in Automotive Paints,
J. Chromatogr. Sci., 1987, 25, 9, 418-423, https://doi.org/10.1093/chromsci/25.9.418
. [all data]
Olson, Wong, et al., 1988
Olson, K.L.; Wong, C.A.; Fleck, L.L.; Lazar, D.F.,
Qualitative and quantitative determination of solvent formulations in automotive paints,
J. Coat. Technol., 1988, 60, 762, 45-50. [all data]