3-Octyn-2-one
- Formula: C8H12O
- Molecular weight: 124.1803
- IUPAC Standard InChIKey: VJKHTMGYHCBXHV-UHFFFAOYSA-N
- CAS Registry Number: 1119-58-0
- Chemical structure:
View 3d structure (requires JavaScript / HTML 5) - Other names: Butyl(acetyl)acetylene; Acetylbutylacetylene; Oct-3-yn-2-one; 3-Octyne-2-one

Gas phase ion energetics data

Data compiled by: Sharon G. Lias, Rhoda D. Levin, and Sherif A. Kafafi
Ionization energy determinations
IE (eV) | Method | Reference | Comment |
---|---|---|---|
9.64 | PE | Carlier and Mouvier, 1979 | Vertical value |

References

Carlier and Mouvier, 1979
Carlier, P.; Mouvier, G.,
Etude par spectrometrie de photoelectrons de la structure electronique des ynals et des ynones conjugues,
J. Electron Spectrosc. Relat. Phenom., 1979, 17, 169. [all data]