1-Pentene, 5-bromo-
- Formula: C5H9Br
- Molecular weight: 149.029
- IUPAC Standard InChIKey: LPNANKDXVBMDKE-UHFFFAOYSA-N
- CAS Registry Number: 1119-51-3
- Chemical structure:
View 3d structure (requires JavaScript / HTML 5) - Other names: 1-Bromo-4-pentene; 4-Pentenyl bromide; 5-Bromo-1-pentene; 5-Bromopentene; 5-bromopent-1-ene

Phase change data

Data compiled by: Robert L. Brown and Stephen E. Stein
Reduced pressure boiling point
Tboil (K) | Pressure (bar) | Reference |
---|---|---|
399.7 | 1.02 | Aldrich Chemical Company Inc., 1990 |

Gas phase ion energetics data

Data compiled by: Sharon G. Lias, Rhoda D. Levin, and Sherif A. Kafafi
Ionization energy determinations
IE (eV) | Method | Reference |
---|---|---|
9.6 | EI | Tomer, Turk, et al., 1972 |
Appearance energy determinations
Ion | AE (eV) | Other Products | Method | Reference | Comment |
---|---|---|---|---|---|
C3H5+ | 12.2 | ? | EI | Tomer, Turk, et al., 1972 | |
C5H9+ | 10.2 | Br | EI | Tomer, Turk, et al., 1972 |

References

Aldrich Chemical Company Inc., 1990
Aldrich Chemical Company Inc.,
Catalog Handbook of Fine Chemicals, Aldrich Chemical Company, Inc., Milwaukee WI, 1990, 1. [all data]
Tomer, Turk, et al., 1972
Tomer, K.B.; Turk, J.; Shapiro, R.H.,
Anchimeric assistance in electron-impact reactions: Homoallylic systems,
Org. Mass Spectrom., 1972, 6, 235. [all data]