1-Butanamine, N-butyl-
- Formula: C8H19N
- Molecular weight: 129.2432
- IUPAC Standard InChIKey: JQVDAXLFBXTEQA-UHFFFAOYSA-N
- CAS Registry Number: 111-92-2
- Chemical structure:
View 3d structure (requires JavaScript / HTML 5) - Other names: Dibutylamine; Di-n-butylamine; N-Dibutylamine; (n-C4H9)2NH; n-Butyl-1-butanamine; di-Normal-butylamine; Dibutilamina; UN 2248; Butylamine, di-n-

Gas phase thermochemistry data

Data compiled as indicated in comments:
ALS - Hussein Y. Afeefy, Joel F. Liebman, and Stephen E. Stein
DRB - Donald R. Burgess, Jr.
Quantity | Value | Units | Method | Reference | Comment |
---|---|---|---|---|---|
ΔfH°gas | -171.1 ± 3.2 | kJ/mol | Ccb | Suradi, Hacking, et al., 1981 | ALS |
ΔfH°gas | -164.9 | kJ/mol | N/A | Lebedeva, Katin, et al., 1971 | Value computed using ΔfHliquid° value of -206.1±0.4 kj/mol from Lebedeva, Katin, et al., 1971 and ΔvapH° value of 41.2 kj/mol from Suradi, Hacking, et al., 1981.; DRB |

Condensed phase thermochemistry data

Data compiled by: Hussein Y. Afeefy, Joel F. Liebman, and Stephen E. Stein
Quantity | Value | Units | Method | Reference | Comment |
---|---|---|---|---|---|
ΔfH°liquid | -212.3 ± 2.5 | kJ/mol | Ccb | Suradi, Hacking, et al., 1981 | |
ΔfH°liquid | -206.1 ± 0.4 | kJ/mol | Ccb | Lebedeva, Katin, et al., 1971 | |
Quantity | Value | Units | Method | Reference | Comment |
ΔcH°liquid | -5651.2 ± 2.2 | kJ/mol | Ccb | Suradi, Hacking, et al., 1981 | |
ΔcH°liquid | -5657.44 ± 0.42 | kJ/mol | Ccb | Lebedeva, Katin, et al., 1971 |

Phase change data

Data compiled as indicated in comments:
BS - Robert L. Brown and Stephen E. Stein
TRC - Thermodynamics Research Center, NIST Boulder Laboratories, Chris Muzny director
ALS - Hussein Y. Afeefy, Joel F. Liebman, and Stephen E. Stein
DRB - Donald R. Burgess, Jr.
AC - William E. Acree, Jr., James S. Chickos
Quantity | Value | Units | Method | Reference | Comment |
---|---|---|---|---|---|
Tboil | 430. ± 20. | K | AVG | N/A | Average of 9 values; Individual data points |
Quantity | Value | Units | Method | Reference | Comment |
Tfus | 211.25 | K | N/A | Timmermans, 1952 | Uncertainty assigned by TRC = 0.5 K; TRC |
Quantity | Value | Units | Method | Reference | Comment |
Tc | 595.8 | K | N/A | Majer and Svoboda, 1985 | |
Tc | 607.5 | K | N/A | Toczylkin. L.S. and Young, 1980 | Uncertainty assigned by TRC = 0.6 K; TRC |
Quantity | Value | Units | Method | Reference | Comment |
Pc | 31.10 | bar | N/A | Toczylkin. L.S. and Young, 1980 | Uncertainty assigned by TRC = 0.3107 bar; Visual; TRC |
Quantity | Value | Units | Method | Reference | Comment |
ΔvapH° | 46. ± 7. | kJ/mol | AVG | N/A | Average of 7 values; Individual data points |
Enthalpy of vaporization
ΔvapH (kJ/mol) | Temperature (K) | Method | Reference | Comment |
---|---|---|---|---|
38.44 | 432.8 | N/A | Majer and Svoboda, 1985 | |
46.0 | 358. | A | Stephenson and Malanowski, 1987 | Based on data from 343. to 479. K.; AC |
46.0 ± 0.1 | 343. | C | Petros, Majer, et al., 1979 | AC |
44.8 ± 0.1 | 358. | C | Petros, Majer, et al., 1979 | AC |
48.1 | 291. | V | Lebedeva, Katin, et al., 1971 | ALS |
Enthalpy of vaporization
ΔvapH =
A exp(-βTr) (1 − Tr)β
ΔvapH =
Enthalpy of vaporization (at saturation pressure)
(kJ/mol)
Tr = reduced temperature (T / Tc)
View plot Requires a JavaScript / HTML 5 canvas capable browser.
Temperature (K) | A (kJ/mol) | β | Tc (K) | Reference | Comment |
---|---|---|---|---|---|
298. to 358. | 71.12 | 0.3042 | 595.8 | Majer and Svoboda, 1985 |

Reaction thermochemistry data

Data compiled as indicated in comments:
M - Michael M. Meot-Ner (Mautner) and Sharon G. Lias
ALS - Hussein Y. Afeefy, Joel F. Liebman, and Stephen E. Stein
Individual Reactions
By formula: C3H9Sn+ + C8H19N = (C3H9Sn+ • C8H19N)
Quantity | Value | Units | Method | Reference | Comment |
---|---|---|---|---|---|
ΔrH° | 204. | kJ/mol | PHPMS | Stone and Splinter, 1984 | gas phase; switching reaction((CH3)3Sn+)CH3OH, Entropy change calculated or estimated; M |
Quantity | Value | Units | Method | Reference | Comment |
ΔrS° | 141. | J/mol*K | N/A | Stone and Splinter, 1984 | gas phase; switching reaction((CH3)3Sn+)CH3OH, Entropy change calculated or estimated; M |
Free energy of reaction
ΔrG° (kJ/mol) | T (K) | Method | Reference | Comment |
---|---|---|---|---|
130. | 525. | PHPMS | Stone and Splinter, 1984 | gas phase; switching reaction((CH3)3Sn+)CH3OH, Entropy change calculated or estimated; M |
+
= C15H23N3O3
By formula: C7H4N2O3 + C8H19N = C15H23N3O3
Quantity | Value | Units | Method | Reference | Comment |
---|---|---|---|---|---|
ΔrH° | -113.6 ± 0.7 | kJ/mol | Cm | Kiselev, Malkov, et al., 1989 | liquid phase; solvent: Dioxane; #TDE; ALS |
+
= C16H16N2O
By formula: C8H19N + C8H7NO = C16H16N2O
Quantity | Value | Units | Method | Reference | Comment |
---|---|---|---|---|---|
ΔrH° | -102.7 ± 0.8 | kJ/mol | Cm | Kiselev, Malkov, et al., 1989 | liquid phase; solvent: Chlorobenzene; ALS |
By formula: H2 + C8H17N = C8H19N
Quantity | Value | Units | Method | Reference | Comment |
---|---|---|---|---|---|
ΔrH° | 86.2 ± 2.6 | kJ/mol | Chyd | Hafelinger and Steinmann, 1977 | liquid phase; solvent: Acetic acid; ALS |
By formula: C7H5NO + C8H19N = C15H24N2O
Quantity | Value | Units | Method | Reference | Comment |
---|---|---|---|---|---|
ΔrH° | -1088.8 ± 1.7 | kJ/mol | Cm | Kiselev, Malkov, et al., 1989 | liquid phase; solvent: Dioxane; ALS |
+
= C16H26N2O
By formula: C8H19N + C8H7NO = C16H26N2O
Quantity | Value | Units | Method | Reference | Comment |
---|---|---|---|---|---|
ΔrH° | -103.3 ± 0.8 | kJ/mol | Cm | Kiselev, Malkov, et al., 1989 | liquid phase; solvent: Dioxane; ALS |
+
= C16H26N2O
By formula: C8H19N + C8H7NO = C16H26N2O
Quantity | Value | Units | Method | Reference | Comment |
---|---|---|---|---|---|
ΔrH° | -96.1 ± 0.7 | kJ/mol | Cm | Kiselev, Malkov, et al., 1989 | liquid phase; solvent: Dioxane; ALS |

Henry's Law data

Data compiled by: Rolf Sander
Henry's Law constant (water solution)
kH(T) = k°H exp(d(ln(kH))/d(1/T) ((1/T) - 1/(298.15 K)))
k°H = Henry's law constant for solubility in water at 298.15 K (mol/(kg*bar))
d(ln(kH))/d(1/T) = Temperature dependence constant (K)
k°H (mol/(kg*bar)) | d(ln(kH))/d(1/T) (K) | Method | Reference |
---|---|---|---|
11. | M | N/A |

Gas phase ion energetics data

Data evaluated as indicated in comments:
HL - Edward P. Hunter and Sharon G. Lias
Data compiled as indicated in comments:
RDSH - Henry M. Rosenstock, Keith Draxl, Bruce W. Steiner, and John T. Herron
Quantity | Value | Units | Method | Reference | Comment |
---|---|---|---|---|---|
Proton affinity (review) | 968.5 | kJ/mol | N/A | Hunter and Lias, 1998 | HL |
Quantity | Value | Units | Method | Reference | Comment |
Gas basicity | 935.3 | kJ/mol | N/A | Hunter and Lias, 1998 | HL |
Ionization energy determinations
IE (eV) | Method | Reference | Comment |
---|---|---|---|
7.69 ± 0.03 | PI | Watanabe and Mottl, 1957 | RDSH |

Ion clustering data

Data compiled by: Michael M. Meot-Ner (Mautner) and Sharon G. Lias
Clustering reactions
By formula: C3H9Sn+ + C8H19N = (C3H9Sn+ • C8H19N)
Quantity | Value | Units | Method | Reference | Comment |
---|---|---|---|---|---|
ΔrH° | 204. | kJ/mol | PHPMS | Stone and Splinter, 1984 | gas phase; switching reaction((CH3)3Sn+)CH3OH, Entropy change calculated or estimated |
Quantity | Value | Units | Method | Reference | Comment |
ΔrS° | 141. | J/mol*K | N/A | Stone and Splinter, 1984 | gas phase; switching reaction((CH3)3Sn+)CH3OH, Entropy change calculated or estimated |
Free energy of reaction
ΔrG° (kJ/mol) | T (K) | Method | Reference | Comment |
---|---|---|---|---|
130. | 525. | PHPMS | Stone and Splinter, 1984 | gas phase; switching reaction((CH3)3Sn+)CH3OH, Entropy change calculated or estimated |

Kovats' RI, non-polar column, isothermal

Column type | Active phase | Temperature (C) | I | Reference | Comment |
---|---|---|---|---|---|
Packed | Apolane | 130. | 943. | Dutoit, 1991 | Column length: 3.7 m |
Packed | OV-101 | 130. | 943. | Osmialowski, Halkiewicz, et al., 1985 | Ar, Chromosorb W HP; Column length: 1. m |
Packed | Apiezon L | 100. | 947. | Golovnya, Zhuravleva, et al., 1980 | N2, Chromosorb GAW; Column length: 2.7 m |
Packed | PMS-100 | 130. | 952. | Anderson, Jurel, et al., 1973 | He, Celite 545 (44-60 mesh); Column length: 3. m |
Packed | PMS-100 | 150. | 952. | Anderson, Jurel, et al., 1973 | He, Celite 545 (44-60 mesh); Column length: 3. m |
Packed | PMS-100 | 180. | 951. | Anderson, Jurel, et al., 1973 | He, Celite 545 (44-60 mesh); Column length: 3. m |
Packed | Apiezon L | 100. | 947. | Golovnya and Zhuravleva, 1973 | |
Packed | Apiezon L | 130. | 948. | Landault and Guiochon, 1964 | Teflon-Haloport; Column length: 2.26 m |

Kovats' RI, polar column, isothermal

Column type | Active phase | Temperature (C) | I | Reference | Comment |
---|---|---|---|---|---|
Packed | PEG-2000 | 120. | 1106. | Anderson, Jurel, et al., 1973 | He, Celite 545 (44-60 mesh); Column length: 3. m |
Packed | PEG-2000 | 150. | 1106. | Anderson, Jurel, et al., 1973 | He, Celite 545 (44-60 mesh); Column length: 3. m |
Packed | PEG-2000 | 152. | 1100. | Anderson, Jurel, et al., 1973 | He, Celite 545 (44-60 mesh); Column length: 3. m |
Packed | PEG-2000 | 179. | 1095. | Anderson, Jurel, et al., 1973 | He, Celite 545 (44-60 mesh); Column length: 3. m |
Packed | PEG-2000 | 180. | 1103. | Anderson, Jurel, et al., 1973 | He, Celite 545 (44-60 mesh); Column length: 3. m |
Packed | PEG-2000 | 200. | 1090. | Anderson, Jurel, et al., 1973 | He, Celite 545 (44-60 mesh); Column length: 3. m |

Normal alkane RI, non-polar column, isothermal

Column type | Active phase | Temperature (C) | I | Reference | Comment |
---|---|---|---|---|---|
Capillary | OV-101 | 130. | 943. | Qi, Yang, et al., 2000 |

Normal alkane RI, non-polar column, custom temperature program

Column type | Active phase | I | Reference | Comment |
---|---|---|---|---|
Capillary | Methyl Silicone | 947. | Chen and Feng, 2007 | Program: not specified |
Capillary | OV-1, SE-30, Methyl silicone, SP-2100, OV-101, DB-1, etc. | 943. | Waggott and Davies, 1984 | Hydrogen; Column length: 50. m; Column diameter: 0.32 mm; Program: not specified |

Normal alkane RI, polar column, custom temperature program

Column type | Active phase | I | Reference | Comment |
---|---|---|---|---|
Capillary | DB-Wax | 1092. | Peng, Yang, et al., 1991 | Program: not specified |

References

Suradi, Hacking, et al., 1981
Suradi, S.; Hacking, J.M.; Pilcher, G.; Gumrukcu, I.; Lappert, M.F.,
Enthalpies of combustion of five sterically hindered amines,
J. Chem. Thermodyn., 1981, 13, 857-861. [all data]
Lebedeva, Katin, et al., 1971
Lebedeva, N.D.; Katin, Y.A.; Akhmedova, G.Y.,
Enthalpies of formation of dipropylamine, di-isopropylamine, dibutylamine, and di-isobutylamine,
Russ. J. Phys. Chem. (Engl. Transl.), 1971, 45, 771-772. [all data]
Timmermans, 1952
Timmermans, J.,
Freezing points of organic compounds. VVI New determinations.,
Bull. Soc. Chim. Belg., 1952, 61, 393. [all data]
Majer and Svoboda, 1985
Majer, V.; Svoboda, V.,
Enthalpies of Vaporization of Organic Compounds: A Critical Review and Data Compilation, Blackwell Scientific Publications, Oxford, 1985, 300. [all data]
Toczylkin. L.S. and Young, 1980
Toczylkin. L.S.; Young, C.L.,
Gas-liquid criticl temperatures of mixtures containing electron donors. II. Amine mixtures,
J. Chem. Thermodyn., 1980, 12, 365. [all data]
Stephenson and Malanowski, 1987
Stephenson, Richard M.; Malanowski, Stanislaw,
Handbook of the Thermodynamics of Organic Compounds, 1987, https://doi.org/10.1007/978-94-009-3173-2
. [all data]
Petros, Majer, et al., 1979
Petros, Libor; Majer, Vladimír; Koubek, Josef; Svoboda, Václav; Pick, Jirí,
Temperature dependence of heats of vaporization, saturated vapour pressures and cohesive energies of secondary amines,
Collect. Czech. Chem. Commun., 1979, 44, 12, 3533-3540, https://doi.org/10.1135/cccc19793533
. [all data]
Stone and Splinter, 1984
Stone, J.A.; Splinter, D.E.,
A high-pressure mass spectrometric study of the binding of (CH3)3Sn+ to lewis bases in the gas phase,
Int. J. Mass Spectrom. Ion Processes, 1984, 59, 169. [all data]
Kiselev, Malkov, et al., 1989
Kiselev, V.D.; Malkov, V.B.; Murzin, D.G.; Shakirov, I.M.; Konovalov, A.I.,
Thermochemical study of the reaction of isocyanate with amines,
Dokl. Phys. Chem. (Engl. Transl.), 1989, 308, 711-713, In original 111. [all data]
Hafelinger and Steinmann, 1977
Hafelinger, G.; Steinmann, L.,
Heat of hydrogenation of compounds containing isolated and conjugted C=N bouble bonds,
Angew. Chem. Int. Ed. Engl., 1977, 16, 47-48. [all data]
Hunter and Lias, 1998
Hunter, E.P.; Lias, S.G.,
Evaluated Gas Phase Basicities and Proton Affinities of Molecules: An Update,
J. Phys. Chem. Ref. Data, 1998, 27, 3, 413-656, https://doi.org/10.1063/1.556018
. [all data]
Watanabe and Mottl, 1957
Watanabe, K.; Mottl, J.R.,
Ionization potentials of ammonia and some amines,
J. Chem. Phys., 1957, 26, 1773. [all data]
Dutoit, 1991
Dutoit, J.,
Gas chromatographic retention behaviour of some solutes on structurally similar polar and non-polar stationary phases,
J. Chromatogr., 1991, 555, 1-2, 191-204, https://doi.org/10.1016/S0021-9673(01)87179-X
. [all data]
Osmialowski, Halkiewicz, et al., 1985
Osmialowski, K.; Halkiewicz, J.; Radecki, A.; Kaliszan, R.,
Quantum chemical parameters in correlation analysis of gas-liquid chromatographic retention indices of amines,
J. Chromatogr., 1985, 346, 53-60, https://doi.org/10.1016/S0021-9673(00)90493-X
. [all data]
Golovnya, Zhuravleva, et al., 1980
Golovnya, R.V.; Zhuravleva, N.L.; Svetlova, N.I.; Grigor'eva, D.N.,
Gas-chromatographic separation of secondary normal alphatic amines,
J. Anal. Chem. USSR (Engl. Transl.), 1980, 35, 10, 1280-1285. [all data]
Anderson, Jurel, et al., 1973
Anderson, A.; Jurel, S.; Shymanska, M.; Golender, L.,
Gas-liquid chromatography of some aliphatic and heterocyclic mono- and pollyfunctional amines. VII. Retention indices of amines in some polar and unpolar stationary phases,
Latv. PSR Zinat. Akad. Vestis Kim. Ser., 1973, 1, 51-63. [all data]
Golovnya and Zhuravleva, 1973
Golovnya, R.V.; Zhuravleva, I.L.,
Gas Chromatographic Method of Identification of n-Aliphatic Amines Through the Use of Donor-Acceptor Interaction with Phosphate,
Chromatographia, 1973, 6, 12, 508-513, https://doi.org/10.1007/BF02269131
. [all data]
Landault and Guiochon, 1964
Landault, C.; Guiochon, G.,
Separation des amines par chromatographie gaz-liquide en utilisant le teflon comme support,
J. Chromatogr., 1964, 13, 327-336, https://doi.org/10.1016/S0021-9673(01)95126-X
. [all data]
Qi, Yang, et al., 2000
Qi, Y.; Yang, J.; Xu, L.,
correlation analysis of the structures and gas liquid chromatographic retention indices of amines,
Chin. J. Anal. Chem., 2000, 28, 2, 223-227. [all data]
Chen and Feng, 2007
Chen, Y.; Feng, C.,
QSPR study on gas chromatography retention index of some organic pollutants,
Comput. Appl. Chem. (China), 2007, 24, 10, 1404-1408. [all data]
Waggott and Davies, 1984
Waggott, A.; Davies, I.W.,
Identification of organic pollutants using linear temperature programmed retention indices (LTPRIs) - Part II, 1984, retrieved from http://dwi.defra.gov.uk/research/completed-research/reports/dwi0383.pdf. [all data]
Peng, Yang, et al., 1991
Peng, C.T.; Yang, Z.C.; Ding, S.F.,
Prediction of rentention idexes. II. Structure-retention index relationship on polar columns,
J. Chromatogr., 1991, 586, 1, 85-112, https://doi.org/10.1016/0021-9673(91)80028-F
. [all data]