2-Butynal
- Formula: C4H4O
- Molecular weight: 68.0740
- IUPAC Standard InChIKey: REJPDMLLCDXIOV-UHFFFAOYSA-N
- CAS Registry Number: 1119-19-3
- Chemical structure:
View 3d structure (requires JavaScript / HTML 5) - Other names: Tetrolaldehyde; But-2-ynal; CH3CCCHO; 1-Formyl-1-propyne; Methylacetyllealdehyde

Phase change data

Data compiled by: Robert L. Brown and Stephen E. Stein
Quantity | Value | Units | Method | Reference | Comment |
---|---|---|---|---|---|
Tboil | 379.7 | K | N/A | Weast and Grasselli, 1989 |
Reduced pressure boiling point
Tboil (K) | Pressure (bar) | Reference |
---|---|---|
300.7 | 0.045 | Weast and Grasselli, 1989 |

Gas phase ion energetics data

Data compiled as indicated in comments:
LLK - Sharon G. Lias, Rhoda D. Levin, and Sherif A. Kafafi
Ionization energy determinations
IE (eV) | Method | Reference | Comment |
---|---|---|---|
10.28 | PE | Terlouw, Burgers, et al., 1979 | LLK |
10.25 ± 0.05 | EI | Holmes and Terlouw, 1979 | LLK |
10.20 | PE | Carlier and Mouvier, 1979 | Vertical value; LLK |

References

Weast and Grasselli, 1989
CRC Handbook of Data on Organic Compounds, 2nd Editon, Weast,R.C and Grasselli, J.G., ed(s)., CRC Press, Inc., Boca Raton, FL, 1989, 1. [all data]
Terlouw, Burgers, et al., 1979
Terlouw, J.K.; Burgers, P.C.; Holmes, J.L.,
Thermochemistry and generation of vinylketene,
J. Am. Chem. Soc., 1979, 101, 225. [all data]
Holmes and Terlouw, 1979
Holmes, J.L.; Terlouw, J.K.,
Structures of [C4H4O]+ ions produced from 2- and 4-pyrone,
J. Am. Chem. Soc., 1979, 101, 4973. [all data]
Carlier and Mouvier, 1979
Carlier, P.; Mouvier, G.,
Etude par spectrometrie de photoelectrons de la structure electronique des ynals et des ynones conjugues,
J. Electron Spectrosc. Relat. Phenom., 1979, 17, 169. [all data]