3,5-Heptanedione, 2,2,6,6-tetramethyl-
- Formula: C11H20O2
- Molecular weight: 184.2753
- IUPAC Standard InChIKey: YRAJNWYBUCUFBD-UHFFFAOYSA-N
- CAS Registry Number: 1118-71-4
- Chemical structure:
View 3d structure (requires JavaScript / HTML 5) - Other names: Dipivaloylmethane; 2,2,6,6-Tetramethyl-3,5-heptanedione; (CH3)3CCOCH2COC(CH3)3; 2,2,6,6-Tetramethylheptane-3,5-dione; 2,2,6,6-Tetramethyl heptanedione

Gas phase thermochemistry data

Data compiled by: Hussein Y. Afeefy, Joel F. Liebman, and Stephen E. Stein
Quantity | Value | Units | Method | Reference | Comment |
---|---|---|---|---|---|
ΔfH°gas | -528.4 ± 3.9 | kJ/mol | Ccb | Ferrao and Ribeiro Da Silva, 1981 | For enol form(98.0%) |

Condensed phase thermochemistry data

Data compiled by: Hussein Y. Afeefy, Joel F. Liebman, and Stephen E. Stein
Quantity | Value | Units | Method | Reference | Comment |
---|---|---|---|---|---|
ΔfH°liquid | -587.7 ± 3.8 | kJ/mol | Ccb | Ferrao and Ribeiro Da Silva, 1981 | |
ΔfH°liquid | -587.9 ± 3.9 | kJ/mol | Ccb | Ferrao and Ribeiro Da Silva, 1981 | For enol form(98.0%) |
Quantity | Value | Units | Method | Reference | Comment |
ΔcH°liquid | -6599.2 ± 3.5 | kJ/mol | Ccb | Ferrao and Ribeiro Da Silva, 1981 | Corresponding ΔfHºliquid = -587.7 kJ/mol (simple calculation by NIST; no Washburn corrections) |

Phase change data

Data compiled as indicated in comments:
BS - Robert L. Brown and Stephen E. Stein
AC - William E. Acree, Jr., James S. Chickos
Quantity | Value | Units | Method | Reference | Comment |
---|---|---|---|---|---|
ΔvapH° | 59.54 | kJ/mol | N/A | Majer and Svoboda, 1985 | |
ΔvapH° | 59.5 | kJ/mol | N/A | Ribeiro da Silva and Irving, 1978 | AC |
Reduced pressure boiling point
Tboil (K) | Pressure (bar) | Reference | Comment |
---|---|---|---|
345.7 | 0.008 | Weast and Grasselli, 1989 | BS |

Reaction thermochemistry data

Data compiled by: Hussein Y. Afeefy, Joel F. Liebman, and Stephen E. Stein
Individual Reactions
By formula: C11H20O2 = C11H20O2
Quantity | Value | Units | Method | Reference | Comment |
---|---|---|---|---|---|
ΔrH° | -21. ± 0.8 | kJ/mol | Eqk | Calmon, 1969 | liquid phase; NMR |

Gas phase ion energetics data

Data compiled as indicated in comments:
LLK - Sharon G. Lias, Rhoda D. Levin, and Sherif A. Kafafi
Ionization energy determinations
IE (eV) | Method | Reference | Comment |
---|---|---|---|
7.9 | PE | Evans, Hamnett, et al., 1972 | LLK |
8.86 ± 0.07 | PE | Evans, Hamnett, et al., 1972 | Vertical value; LLK |

References

Ferrao and Ribeiro Da Silva, 1981
Ferrao, M.L.C.C.H.; Ribeiro Da Silva, M.A.V.,
Enthalpies of combustion of four methyl-substituted heptane-3,5-diones and benzoylacetone,
J. Chem. Thermodyn., 1981, 13, 567-571. [all data]
Majer and Svoboda, 1985
Majer, V.; Svoboda, V.,
Enthalpies of Vaporization of Organic Compounds: A Critical Review and Data Compilation, Blackwell Scientific Publications, Oxford, 1985, 300. [all data]
Ribeiro da Silva and Irving, 1978
Ribeiro da Silva, M.A.V.; Irving, R.G.,
Rev. Port. Quim., 1978, 20, 36. [all data]
Weast and Grasselli, 1989
CRC Handbook of Data on Organic Compounds, 2nd Editon, Weast,R.C and Grasselli, J.G., ed(s)., CRC Press, Inc., Boca Raton, FL, 1989, 1. [all data]
Calmon, 1969
Calmon, J.P.,
Thermodynamic functions of enolization of aliphatic β-diketones,
C. R. Acad. Sci. Paris, 1969, 268, 1435-1438. [all data]
Evans, Hamnett, et al., 1972
Evans, S.; Hamnett, A.; Orchard, A.F.; Lloyd, D.R.,
Study of the metal-oxygen bond in simple tris-chelate complexes by He(I) photoelectron spectroscopy,
Faraday Discuss. Chem. Soc., 1972, 54, 227. [all data]