Nonane
- Formula: C9H20
- Molecular weight: 128.2551
- IUPAC Standard InChIKey: BKIMMITUMNQMOS-UHFFFAOYSA-N
- CAS Registry Number: 111-84-2
- Chemical structure:
View 3d structure (requires JavaScript / HTML 5) - Other names: n-Nonane; Shellsol 140; n-C9H20; UN 1920

Gas phase ion energetics data

Data evaluated as indicated in comments:
L - Sharon G. Lias
Data compiled as indicated in comments:
LL - Sharon G. Lias and Joel F. Liebman
LBLHLM - Sharon G. Lias, John E. Bartmess, Joel F. Liebman, John L. Holmes, Rhoda D. Levin, and W. Gary Mallard
LLK - Sharon G. Lias, Rhoda D. Levin, and Sherif A. Kafafi
RDSH - Henry M. Rosenstock, Keith Draxl, Bruce W. Steiner, and John T. Herron
Quantity | Value | Units | Method | Reference | Comment |
---|---|---|---|---|---|
IE (evaluated) | 9.71 ± 0.10 | eV | N/A | N/A | L |
Ionization energy determinations
IE (eV) | Method | Reference | Comment |
---|---|---|---|
9.87 | EST | Luo and Pacey, 1992 | LL |
9.71 ± 0.10 | EVAL | Lias, 1982 | LBLHLM |
9.63 ± 0.15 | EQ | Mautner(Meot-Ner), Sieck, et al., 1981 | LLK |
10.19 | EI | Potzinger and Bunau, 1969 | RDSH |
Appearance energy determinations
Ion | AE (eV) | Other Products | Method | Reference | Comment |
---|---|---|---|---|---|
C2H5+ | 13.20 | ? | EI | Potzinger and Bunau, 1969 | RDSH |
C3H7+ | 12.17 | ? | EI | Potzinger and Bunau, 1969 | RDSH |
C4H9+ | 11.15 | ? | EI | Potzinger and Bunau, 1969 | RDSH |
C5H11+ | 11.10 | C4H9 | EI | Potzinger and Bunau, 1969 | RDSH |
C6H13+ | 10.63 | ? | EI | Potzinger and Bunau, 1969 | RDSH |

Lee's RI, non-polar column, temperature ramp

Column type | Active phase | I | Reference | Comment |
---|---|---|---|---|
Capillary | DB-5MS | 138.27 | Chen, Keeran, et al., 2002 | 30. m/0.25 mm/0.5 μm, 40. C @ 1. min, 10. K/min; Tend: 310. C |
Capillary | DB-5MS | 144.03 | Chen, Keeran, et al., 2002 | 30. m/0.25 mm/0.5 μm, 40. C @ 1. min, 4. K/min; Tend: 310. C |

Reaction thermochemistry data

Data compiled by: Hussein Y. Afeefy, Joel F. Liebman, and Stephen E. Stein
Individual Reactions
By formula: 2H2 + C9H16 = C9H20
Quantity | Value | Units | Method | Reference | Comment |
---|---|---|---|---|---|
ΔrH° | -272.3 ± 2.1 | kJ/mol | Chyd | Rogers, Dagdagan, et al., 1979 | liquid phase; solvent: Hexane |
By formula: 2H2 + C9H16 = C9H20
Quantity | Value | Units | Method | Reference | Comment |
---|---|---|---|---|---|
ΔrH° | -270.7 ± 1.4 | kJ/mol | Chyd | Rogers, Dagdagan, et al., 1979 | liquid phase; solvent: Hexane |
By formula: 2H2 + C9H16 = C9H20
Quantity | Value | Units | Method | Reference | Comment |
---|---|---|---|---|---|
ΔrH° | -271.8 ± 1.8 | kJ/mol | Chyd | Rogers, Dagdagan, et al., 1979 | liquid phase; solvent: Hexane |
By formula: C9H18 + H2 = C9H20
Quantity | Value | Units | Method | Reference | Comment |
---|---|---|---|---|---|
ΔrH° | -124.3 ± 1.0 | kJ/mol | Chyd | Rogers and Skanupong, 1974 | liquid phase; solvent: Hexane |
By formula: 2H2 + C9H16 = C9H20
Quantity | Value | Units | Method | Reference | Comment |
---|---|---|---|---|---|
ΔrH° | -291.0 ± 1.9 | kJ/mol | Chyd | Rogers, Dagdagan, et al., 1979 | liquid phase; solvent: Hexane |

Gas phase thermochemistry data

Data compiled as indicated in comments:
DRB - Donald R. Burgess, Jr.
GT - Glushko Thermocenter, Russian Academy of Sciences, Moscow
Quantity | Value | Units | Method | Reference | Comment |
---|---|---|---|---|---|
ΔfH°gas | -54.57 | kcal/mol | N/A | Good, 1969 | Value computed using ΔfHliquid° value of -274.7±1 kj/mol from Good, 1969 and ΔvapH° value of 46.43 kj/mol from missing citation.; DRB |
Quantity | Value | Units | Method | Reference | Comment |
S°gas | 121.06 ± 0.24 | cal/mol*K | N/A | Scott D.W., 1974 | This reference does not contain the original experimental data. Experimental entropy value is based on the results [ Messerly J.F., 1967] for S(liquid).; GT |
Constant pressure heat capacity of gas
Cp,gas (cal/mol*K) | Temperature (K) | Reference | Comment |
---|---|---|---|
38.700 | 200. | Scott D.W., 1974, 2 | Recommended values were obtained from the consistent correlation scheme for alkanes [ Scott D.W., 1974, Scott D.W., 1974, 2]. This approach gives a good agreement with experimental data available for alkanes. However, large uncertainties could be expected at high temperatures.; GT |
47.029 | 273.15 | ||
50.3 ± 0.1 | 298.15 | ||
50.531 | 300. | ||
64.250 | 400. | ||
76.850 | 500. | ||
87.500 | 600. | ||
96.401 | 700. | ||
103.70 | 800. | ||
109.90 | 900. | ||
115.10 | 1000. | ||
119.50 | 1100. | ||
123.40 | 1200. | ||
127.00 | 1300. | ||
130.00 | 1400. | ||
133.00 | 1500. |

Condensed phase thermochemistry data

Data compiled as indicated in comments:
ALS - Hussein Y. Afeefy, Joel F. Liebman, and Stephen E. Stein
DH - Eugene S. Domalski and Elizabeth D. Hearing
Quantity | Value | Units | Method | Reference | Comment |
---|---|---|---|---|---|
ΔfH°liquid | -65.65 ± 0.24 | kcal/mol | Ccr | Good, 1969 | ALS |
Quantity | Value | Units | Method | Reference | Comment |
ΔcH°liquid | -1463.96 ± 0.13 | kcal/mol | Ccr | Good, 1969 | Corresponding ΔfHºliquid = -65.65 kcal/mol (simple calculation by NIST; no Washburn corrections); ALS |
ΔcH°liquid | -1463.89 ± 0.27 | kcal/mol | Ccb | Prosen and Rossini, 1944 | Corresponding ΔfHºliquid = -65.72 kcal/mol (simple calculation by NIST; no Washburn corrections); ALS |
ΔcH°liquid | -1462.7 | kcal/mol | Ccb | Jessup, 1937 | Corresponding ΔfHºliquid = -66.95 kcal/mol (simple calculation by NIST; no Washburn corrections); ALS |
Quantity | Value | Units | Method | Reference | Comment |
S°liquid | 94.089 | cal/mol*K | N/A | Finke, Gross, et al., 1954 | DH |
S°liquid | 93.91 | cal/mol*K | N/A | Huffman, Parks, et al., 1931 | Extrapolation below 90 K, 83.09 J/mol*K.; DH |
Constant pressure heat capacity of liquid
Cp,liquid (cal/mol*K) | Temperature (K) | Reference | Comment |
---|---|---|---|
69.833 | 318.15 | Banipal, Garg, et al., 1991 | T = 318 to 373 K. p = 0.1 MPa.; DH |
67.959 | 298.15 | Trejo, Costas, et al., 1991 | DH |
68.059 | 298.15 | Andreoli-Ball, Patterson, et al., 1988 | DH |
67.83 | 298.15 | Wilhelm, Inglese, et al., 1982 | DH |
70.08 | 323. | Zaripov, 1982 | T = 298, 323, 363 K.; DH |
67.88 | 298.15 | Grolier, Hamedi, et al., 1979 | DH |
77.01 | 350. | Swietoslawski and Zielenkiewicz, 1958 | Mean value over the temperature range 22 to 129°C.; DH |
67.971 | 298.15 | Finke, Gross, et al., 1954 | T = 12 to 320 K.; DH |
67.880 | 298.15 | Osborne and Ginnings, 1947 | T = 278 to 318 K.; DH |
67.09 | 297.9 | Huffman, Parks, et al., 1931 | T = 93 to 298 K. Value is unsmoothed experimental datum.; DH |
67.21 | 299.1 | Parks, Huffman, et al., 1930 | T = 224 to 299 K. Value is unsmoothed experimental datum.; DH |

Phase change data

Data compiled as indicated in comments:
BS - Robert L. Brown and Stephen E. Stein
TRC - Thermodynamics Research Center, NIST Boulder Laboratories, Chris Muzny director
AC - William E. Acree, Jr., James S. Chickos
ALS - Hussein Y. Afeefy, Joel F. Liebman, and Stephen E. Stein
DH - Eugene S. Domalski and Elizabeth D. Hearing
Quantity | Value | Units | Method | Reference | Comment |
---|---|---|---|---|---|
Tboil | 423.8 ± 0.3 | K | AVG | N/A | Average of 44 out of 51 values; Individual data points |
Quantity | Value | Units | Method | Reference | Comment |
Tfus | 219.5 ± 0.5 | K | AVG | N/A | Average of 24 values; Individual data points |
Quantity | Value | Units | Method | Reference | Comment |
Ttriple | 219.6 ± 0.3 | K | AVG | N/A | Average of 7 values; Individual data points |
Quantity | Value | Units | Method | Reference | Comment |
Tc | 595. ± 1. | K | AVG | N/A | Average of 16 values; Individual data points |
Quantity | Value | Units | Method | Reference | Comment |
Pc | 22.7 ± 0.4 | atm | AVG | N/A | Average of 10 values; Individual data points |
Quantity | Value | Units | Method | Reference | Comment |
Vc | 0.555 | l/mol | N/A | Ambrose and Tsonopoulos, 1995 | |
Quantity | Value | Units | Method | Reference | Comment |
ρc | 1.80 ± 0.05 | mol/l | N/A | Ambrose and Tsonopoulos, 1995 | |
ρc | 1.84 | mol/l | N/A | Steele, 1992 | Uncertainty assigned by TRC = 0.078 mol/l; TRC |
ρc | 1.80 | mol/l | N/A | Anselme, Gude, et al., 1990 | Uncertainty assigned by TRC = 0.05 mol/l; TRC |
Quantity | Value | Units | Method | Reference | Comment |
ΔvapH° | 11.11 ± 0.04 | kcal/mol | AVG | N/A | Average of 7 values; Individual data points |
Enthalpy of vaporization
ΔvapH (kcal/mol) | Temperature (K) | Method | Reference | Comment |
---|---|---|---|---|
8.822 | 424. | N/A | Majer and Svoboda, 1985 | |
11.2 | 299. | C | Viton, Chavret, et al., 1996 | AC |
11. | 314. | C | Viton, Chavret, et al., 1996 | AC |
11.5 | 234. | A | Stephenson and Malanowski, 1987 | Based on data from 219. to 308. K. See also Carruth and Kobayashi, 1973.; AC |
10.2 | 359. | A,MM | Stephenson and Malanowski, 1987 | Based on data from 344. to 426. K. See also Willingham, Taylor, et al., 1945 and Forziati, Norris, et al., 1949.; AC |
10.5 | 337. | N/A | Paul, Krug, et al., 1986 | Based on data from 322. to 413. K.; AC |
10.6 | 328. | C | Majer, Svoboda, et al., 1984 | AC |
10.3 | 343. | C | Majer, Svoboda, et al., 1984 | AC |
10.1 | 358. | C | Majer, Svoboda, et al., 1984 | AC |
Enthalpy of vaporization
ΔvapH =
A exp(-βTr) (1 − Tr)β
ΔvapH =
Enthalpy of vaporization (at saturation pressure)
(kcal/mol)
Tr = reduced temperature (T / Tc)
View plot Requires a JavaScript / HTML 5 canvas capable browser.
Temperature (K) | A (kcal/mol) | β | Tc (K) | Reference | Comment |
---|---|---|---|---|---|
298. to 368. | 15.89 | 0.3 | 594.6 | Majer and Svoboda, 1985 |
Antoine Equation Parameters
log10(P) = A − (B / (T + C))
P = vapor pressure (atm)
T = temperature (K)
View plot Requires a JavaScript / HTML 5 canvas capable browser.
Temperature (K) | A | B | C | Reference | Comment |
---|---|---|---|---|---|
219.7 to 307.73 | 3.81918 | 1492.928 | -55.895 | Carruth and Kobayashi, 1973 | Coefficents calculated by NIST from author's data. |
343.49 to 424.94 | 4.05674 | 1430.377 | -71.355 | Forziati, Norris, et al., 1949, 2 | Coefficents calculated by NIST from author's data. |
Enthalpy of sublimation
ΔsubH (kcal/mol) | Temperature (K) | Method | Reference | Comment |
---|---|---|---|---|
17.8 | 219. | B | Bondi, 1963 | AC |
Enthalpy of fusion
ΔfusH (kcal/mol) | Temperature (K) | Method | Reference | Comment |
---|---|---|---|---|
3.59 | 219.5 | DSC | Mondieig, Rajabalee, et al., 2004 | AC |
3.700 | 219.7 | N/A | Acree, 1991 | See also Domalski and Hearing, 1996.; AC |
Enthalpy of phase transition
ΔHtrs (kcal/mol) | Temperature (K) | Initial Phase | Final Phase | Reference | Comment |
---|---|---|---|---|---|
1.501 | 217.2 | crystaline, II | crystaline, I | Finke, Gross, et al., 1954 | DH |
3.6969 | 219.66 | crystaline, I | liquid | Finke, Gross, et al., 1954 | DH |
5.2870 | 219.2 | crystaline, I | liquid | Huffman, Parks, et al., 1931 | Included heat effect due to transition just below melting point.; DH |
Entropy of phase transition
ΔStrs (cal/mol*K) | Temperature (K) | Initial Phase | Final Phase | Reference | Comment |
---|---|---|---|---|---|
6.910 | 217.2 | crystaline, II | crystaline, I | Finke, Gross, et al., 1954 | DH |
16.83 | 219.66 | crystaline, I | liquid | Finke, Gross, et al., 1954 | DH |
24.12 | 219.2 | crystaline, I | liquid | Huffman, Parks, et al., 1931 | Included; DH |

Henry's Law data

Data compiled by: Rolf Sander
Henry's Law constant (water solution)
kH(T) = k°H exp(d(ln(kH))/d(1/T) ((1/T) - 1/(298.15 K)))
k°H = Henry's law constant for solubility in water at 298.15 K (mol/(kg*bar))
d(ln(kH))/d(1/T) = Temperature dependence constant (K)
k°H (mol/(kg*bar)) | d(ln(kH))/d(1/T) (K) | Method | Reference | Comment |
---|---|---|---|---|
0.00017 | Q | N/A | missing citation give several references for the Henry's law constants but don't assign them to specific species. | |
0.0024 | 210. | X | N/A | |
0.00020 | L | N/A |

References

Luo and Pacey, 1992
Luo, Y.-R.; Pacey, P.D.,
Effects of alkyl substitution on ionization energies of alkanes and haloalkanes and on heats of formation of their molecular cations. Part 2. Alkanes and chloro-, bromo- and iodoalkanes,
Int. J. Mass Spectrom. Ion Processes, 1992, 112, 63. [all data]
Lias, 1982
Lias, S.G.,
Thermochemical information from ion-molecule rate constants,
Ion Cyclotron Reson. Spectrom. 1982, 1982, 409. [all data]
Mautner(Meot-Ner), Sieck, et al., 1981
Mautner(Meot-Ner), M.; Sieck, L.W.; Ausloos, P.,
Ionization of normal alkanes: Enthalpy, entropy, structural, and isotope effects,
J. Am. Chem. Soc., 1981, 103, 5342. [all data]
Potzinger and Bunau, 1969
Potzinger, P.; Bunau, G.v.,
Empirische Beruksichtigung von Uberschussenergien bei der Auftrittspotentialbestimmung,
Ber. Bunsen-Ges. Phys. Chem., 1969, 73, 466. [all data]
Chen, Keeran, et al., 2002
Chen, P.H.; Keeran, W.S.; Van Ausdale, W.A.; Schindler, D.R.; Roberts, D.W.,
Application of Lee retention indices to the confirmation of tentatively identified compounds from GC/MS analysis of environmental samples, Technical paper, Analytical Services Division, Environmental ScienceEngineering, Inc, PO Box 1703, Gainesville, FL 32602, 2002, 11. [all data]