Octane, 1-bromo-
- Formula: C8H17Br
- Molecular weight: 193.125
- IUPAC Standard InChIKey: VMKOFRJSULQZRM-UHFFFAOYSA-N
- CAS Registry Number: 111-83-1
- Chemical structure:
View 3d structure (requires JavaScript / HTML 5) - Other names: n-Octyl bromide; Octyl bromide; 1-Bromooctane; 1-Octylbromide

Gas phase thermochemistry data

Data compiled by: Hussein Y. Afeefy, Joel F. Liebman, and Stephen E. Stein
Quantity | Value | Units | Method | Reference | Comment |
---|---|---|---|---|---|
ΔfH°gas | -190.1 ± 2.3 | kJ/mol | Ccr | Bjellerup, 1961 | Reanalyzed by Cox and Pilcher, 1970, Original value = -193.6 ± 2.7 kJ/mol |

Condensed phase thermochemistry data

Data compiled by: Hussein Y. Afeefy, Joel F. Liebman, and Stephen E. Stein
Quantity | Value | Units | Method | Reference | Comment |
---|---|---|---|---|---|
ΔfH°liquid | -245.2 ± 2.3 | kJ/mol | Ccr | Bjellerup, 1961 | |
Quantity | Value | Units | Method | Reference | Comment |
ΔcH°liquid | -5332.6 ± 2.3 | kJ/mol | Ccr | Bjellerup, 1961 |

Gas phase ion energetics data

Data compiled by: Sharon G. Lias and Joel F. Liebman
Ionization energy determinations
IE (eV) | Method | Reference |
---|---|---|
9.71 | EST | Luo and Pacey, 1992 |
9.54 ± 0.05 | EI | Holmes and Lossing, 1991 |

Kovats' RI, non-polar column, isothermal

Data compiled by: NIST Mass Spectrometry Data Center, William E. Wallace, director

Column type CapillaryCapillaryCapillaryCapillaryCapillary
Active phase OV-101OV-101OV-101OV-101OV-101
Column length (m) 54.54.54.54.54.
Carrier gas HeliumHeliumHeliumHeliumHelium
Substrate
Column diameter (mm) 0.260.260.260.260.26
Phase thickness (μm)
Temperature (C) 100.100.100.100.100.
I 1118.1119.1121.1122.1124.
ReferenceZenkevich and Tsibulskaya, 1989Zenkevich and Tsibulskaya, 1989Zenkevich and Tsibulskaya, 1989Zenkevich and Tsibulskaya, 1989Zenkevich and Tsibulskaya, 1989
Comment MSDC-RI MSDC-RI MSDC-RI MSDC-RI MSDC-RI
Column type CapillaryCapillaryCapillaryCapillaryCapillary
Active phase OV-101OV-101OV-101OV-101OV-101
Column length (m) 54.54.54.54.54.
Carrier gas HeliumHeliumHeliumHeliumHelium
Substrate
Column diameter (mm) 0.260.260.260.260.26
Phase thickness (μm)
Temperature (C) 100.100.100.100.100.
I 1126.1129.1130.1132.1133.
ReferenceZenkevich and Tsibulskaya, 1989Zenkevich and Tsibulskaya, 1989Zenkevich and Tsibulskaya, 1989Zenkevich and Tsibulskaya, 1989Zenkevich and Tsibulskaya, 1989
Comment MSDC-RI MSDC-RI MSDC-RI MSDC-RI MSDC-RI
Column type Capillary
Active phase Squalane
Column length (m) 100.
Carrier gas
Substrate
Column diameter (mm) 0.25
Phase thickness (μm)
Temperature (C) 115.
I 1119.
ReferenceLafosse and Thuaud-Chourrout, 1975
Comment MSDC-RI

Normal alkane RI, non-polar column, custom temperature program

Data compiled by: NIST Mass Spectrometry Data Center, William E. Wallace, director

Column type Capillary
Active phase OV-1, SE-30, Methyl silicone, SP-2100, OV-101, DB-1, etc.
Column length (m) 50.
Carrier gas Hydrogen
Substrate
Column diameter (mm) 0.32
Phase thickness (μm)
Program not specified
I 1132.
ReferenceWaggott and Davies, 1984
Comment MSDC-RI

Normal alkane RI, non-polar column, isothermal

Data compiled by: NIST Mass Spectrometry Data Center, William E. Wallace, director

Column type Capillary
Active phase Apiezon L
Column length (m)
Carrier gas
Substrate
Column diameter (mm)
Phase thickness (μm)
Temperature (C) 130.
I 1142.
ReferenceArruda, Junkes, et al., 2008
Comment MSDC-RI

Normal alkane RI, polar column, custom temperature program

Data compiled by: NIST Mass Spectrometry Data Center, William E. Wallace, director

Column type Capillary
Active phase DB-Wax
Column length (m)
Carrier gas
Substrate
Column diameter (mm)
Phase thickness (μm)
Program not specified
I 1385.
ReferencePeng, Yang, et al., 1991
Comment MSDC-RI

Phase change data

Data compiled as indicated in comments:
BS - Robert L. Brown and Stephen E. Stein
TRC - Thermodynamics Research Center, NIST Boulder Laboratories, Chris Muzny director
AC - William E. Acree, Jr., James S. Chickos
ALS - Hussein Y. Afeefy, Joel F. Liebman, and Stephen E. Stein

Quantity Value Units Method Reference Comment
Tboil474.KN/AFarchan Laboratories, 1990BS
Tboil474.0KN/AWeast and Grasselli, 1989BS
Tboil474.KN/AAmerican Tokyo Kasei, 1988BS
Tboil474.KN/AKazanskii, Liberman, et al., 1947Uncertainty assigned by TRC = 6. K; TRC
Tboil471.KN/AKamm and Marvel, 1920Uncertainty assigned by TRC = 5. K; TRC
Quantity Value Units Method Reference Comment
Tfus218.2KN/ACrowe and Smyth, 1950Uncertainty assigned by TRC = 0.2 K; TRC
Quantity Value Units Method Reference Comment
Δvap13.33kcal/molN/AMajer and Svoboda, 1985
Δvap13.2kcal/molCGCChickos, Hosseini, et al., 1995Based on data from 323. - 363. K.; AC
Δvap13.33 ± 0.060kcal/molCMansson, Sellers, et al., 1977ALS
Δvap13.3 ± 0.02kcal/molCStridh, 1976See also Månsson, Sellers, et al., 1977.; AC

Enthalpy of vaporization

ΔvapH (kcal/mol) Temperature (K) Method Reference Comment
11.8388.A,ESTStephenson and Malanowski, 1987Based on data from 373. - 475. K. See also Li and Rossini, 1961 and Dykyj and Vanko, 1970.; AC

Enthalpy of fusion

ΔfusH (kcal/mol) Temperature (K) Reference Comment
5.901218.2Crowe and Smyth, 1950, 2AC

In addition to the Thermodynamics Research Center (TRC) data available from this site, much more physical and chemical property data is available from the following TRC products:

References

Bjellerup, 1961
Bjellerup, L.,
Heats of combustion and formation of the 1-bromoalkanes from C4 through C8,
Acta Chem. Scand., 1961, 15, 231-241. [all data]
Cox and Pilcher, 1970
Cox, J.D.; Pilcher, G.,
Thermochemistry of Organic and Organometallic Compounds, Academic Press, New York, 1970, 1-636. [all data]
Luo and Pacey, 1992
Luo, Y.-R.; Pacey, P.D.,
Effects of alkyl substitution on ionization energies of alkanes and haloalkanes and on heats of formation of their molecular cations. Part 2. Alkanes and chloro-, bromo- and iodoalkanes,
Int. J. Mass Spectrom. Ion Processes, 1992, 112, 63. [all data]
Holmes and Lossing, 1991
Holmes, J.L.; Lossing, F.P.,
Ionization energies of homologous organic compounds and correlation with molecular size,
Org. Mass Spectrom., 1991, 26, 537. [all data]