Silane, isocyanatotrimethyl-
- Formula: C4H9NOSi
- Molecular weight: 115.2059
- IUPAC Standard InChIKey: NIZHERJWXFHGGU-UHFFFAOYSA-N
- CAS Registry Number: 1118-02-1
- Chemical structure:
View 3d structure (requires JavaScript / HTML 5) - Other names: Isocyanatotrimethylsilane; Isocyanic acid, trimethylsilyl ester; Trimethylisocyanatosilane; Trimethylsilyl isocyanate

Phase change data

Data compiled by: Robert L. Brown and Stephen E. Stein
Quantity | Value | Units | Method | Reference | Comment |
---|---|---|---|---|---|
Tboil | 364. | K | N/A | PCR Inc., 1990 |

Gas phase ion energetics data

Data compiled as indicated in comments:
LL - Sharon G. Lias and Joel F. Liebman
LLK - Sharon G. Lias, Rhoda D. Levin, and Sherif A. Kafafi
Ionization energy determinations
IE (eV) | Method | Reference | Comment |
---|---|---|---|
10.50 | PE | Veszpremi, Pasinszki, et al., 1991 | Vertical value; LL |
10.3 ± 0.1 | PE | Cradock, Ebsworth, et al., 1972 | Vertical value; LLK |

Normal alkane RI, non-polar column, temperature ramp

Column type | Active phase | I | Reference | Comment |
---|---|---|---|---|
Capillary | OV-101 | 670. | Zenkevich, 2005 | 25. m/0.20 mm/0.10 μm, N2/He, 6. K/min; Tstart: 50. C; Tend: 250. C |

References

PCR Inc., 1990
PCR Inc.,
Research Chemicals Catalog 1990-1991, PCR Inc., Gainesville, FL, 1990, 1. [all data]
Veszpremi, Pasinszki, et al., 1991
Veszpremi, T.; Pasinszki, T.; Feher, M.,
Photoelectron spectroscopic studies of the silicon pseudohalides: Relationship between geometrical and electronic structure,
J. Chem. Soc. Faraday Trans., 1991, 87, 3805. [all data]
Cradock, Ebsworth, et al., 1972
Cradock, S.; Ebsworth, E.A.V.; Murdoch, J.D.,
Photoelectron spectra of some Group 4 pseudohalides and related compounds,
J. Chem. Soc. Faraday Trans. 2, 1972, 68, 86. [all data]
Zenkevich, 2005
Zenkevich, I.G.,
Experimentally measured retention indices., 2005. [all data]