Propane, 1-methoxy-2,2-dimethyl-
- Formula: C6H14O
- Molecular weight: 102.1748
- IUPAC Standard InChIKey: JILHZKWLEAKYRC-UHFFFAOYSA-N
- CAS Registry Number: 1118-00-9
- Chemical structure:
View 3d structure (requires JavaScript / HTML 5) - Other names: Ether, methyl neopentyl; (CH3)3CCH2OCH3; Neopentyl methyl ether

Gas phase ion energetics data

Data evaluated as indicated in comments:
HL - Edward P. Hunter and Sharon G. Lias
Data compiled as indicated in comments:
LL - Sharon G. Lias and Joel F. Liebman
LLK - Sharon G. Lias, Rhoda D. Levin, and Sherif A. Kafafi
Quantity | Value | Units | Method | Reference | Comment |
---|---|---|---|---|---|
Proton affinity (review) | 825.8 | kJ/mol | N/A | Hunter and Lias, 1998 | HL |
Quantity | Value | Units | Method | Reference | Comment |
Gas basicity | 796.7 | kJ/mol | N/A | Hunter and Lias, 1998 | HL |
Ionization energy determinations
IE (eV) | Method | Reference | Comment |
---|---|---|---|
9.30 ± 0.05 | EI | Bissonnette, George, et al., 1990 | LL |
9.64 ± 0.05 | PE | Block, Yencha, et al., 1988 | Vertical value; LL |
9.41 | PE | Bachiri, Mouvier, et al., 1980 | Vertical value; LLK |
Appearance energy determinations
Ion | AE (eV) | Other Products | Method | Reference | Comment |
---|---|---|---|---|---|
C4H8+ | 10.1 ± 0.1 | CH3OCH3 | EI | Bissonnette, George, et al., 1990 | LL |
C5H10O+ | 10.0 ± 0.1 | CH3OH | EI | Bissonnette, George, et al., 1990 | LL |

References

Hunter and Lias, 1998
Hunter, E.P.; Lias, S.G.,
Evaluated Gas Phase Basicities and Proton Affinities of Molecules: An Update,
J. Phys. Chem. Ref. Data, 1998, 27, 3, 413-656, https://doi.org/10.1063/1.556018
. [all data]
Bissonnette, George, et al., 1990
Bissonnette, M.; George, M.; Holmes, J.L.,
The experimental investigation of [C5H12O] ion structures related to neopentyl alcohol and its methyl ether,
Int. J. Mass Spectrom. Ion Processes, 1990, 101, 309. [all data]
Block, Yencha, et al., 1988
Block, E.; Yencha, A.J.; Aslam, M.; Eswarakrishnan, V.; Luo, J.; Sano, A.,
Gas-phase determination of the geometric requirements of the silicon B-effect. Photoelectron and penning ionization electron spectroscopic study of silylthiiranes and -oxiranes. Synthesis and chemistry of trans-2,3-bis(trimethylsilyl)thiirane,
J. Am. Chem. Soc., 1988, 110, 4748. [all data]
Bachiri, Mouvier, et al., 1980
Bachiri, M.; Mouvier, G.; Carlier, P.; Dubois, J.E.,
Evaluation quantitative des effets de substituants sur les premiers potentiels d'ionisation de composes monofonctionnels aliphatiques,
J. Chim. Phys., 1980, 77, 899. [all data]