1-Octene
- Formula: C8H16
- Molecular weight: 112.2126
- IUPAC Standard InChIKey: KWKAKUADMBZCLK-UHFFFAOYSA-N
- CAS Registry Number: 111-66-0
- Chemical structure:
View 3d structure (requires JavaScript / HTML 5) - Other names: α-Octene; α-Octylene; n-1-Octene; Caprylene; 1-C8H16; Oct-1-ene; Octene-1; Neodene 8; Octylene; 1-n-Octene; NSC 8457; SHOP C8

Gas phase thermochemistry data

Data compiled by: Hussein Y. Afeefy, Joel F. Liebman, and Stephen E. Stein
Quantity | Value | Units | Method | Reference | Comment |
---|---|---|---|---|---|
ΔfH°gas | -82.93 | kJ/mol | Chyd | Bretschneider and Rogers, 1970 | |
ΔfH°gas | -82.93 | kJ/mol | Ccb | Rockenfeller and Rossini, 1961 |

Condensed phase thermochemistry data

Data compiled as indicated in comments:
ALS - Hussein Y. Afeefy, Joel F. Liebman, and Stephen E. Stein
DH - Eugene S. Domalski and Elizabeth D. Hearing
Quantity | Value | Units | Method | Reference | Comment |
---|---|---|---|---|---|
ΔfH°liquid | -121.8 ± 1.2 | kJ/mol | Ccb | Rockenfeller and Rossini, 1961 | Reanalyzed by Cox and Pilcher, 1970, Original value = -123.5 kJ/mol; ALS |
Quantity | Value | Units | Method | Reference | Comment |
ΔcH°liquid | -5312.9 ± 1.1 | kJ/mol | Ccb | Rockenfeller and Rossini, 1961 | Corresponding ΔfHºliquid = -121.8 kJ/mol (simple calculation by NIST; no Washburn corrections); ALS |
Quantity | Value | Units | Method | Reference | Comment |
S°liquid | 360.45 | J/mol*K | N/A | McCullough, Finke, et al., 1957 | DH |
Constant pressure heat capacity of liquid
Cp,liquid (J/mol*K) | Temperature (K) | Reference | Comment |
---|---|---|---|
241.21 | 298.15 | McCullough, Finke, et al., 1957 | T = 11 to 360 K.; DH |

Phase change data

Data compiled as indicated in comments:
BS - Robert L. Brown and Stephen E. Stein
TRC - Thermodynamics Research Center, NIST Boulder Laboratories, Chris Muzny director
AC - William E. Acree, Jr., James S. Chickos
ALS - Hussein Y. Afeefy, Joel F. Liebman, and Stephen E. Stein
DH - Eugene S. Domalski and Elizabeth D. Hearing
Quantity | Value | Units | Method | Reference | Comment |
---|---|---|---|---|---|
Tboil | 395. ± 2. | K | AVG | N/A | Average of 60 out of 61 values; Individual data points |
Quantity | Value | Units | Method | Reference | Comment |
Tfus | 171. ± 2. | K | AVG | N/A | Average of 10 values; Individual data points |
Quantity | Value | Units | Method | Reference | Comment |
Ttriple | 171.46 | K | N/A | McCullough, Finke, et al., 1957, 2 | Uncertainty assigned by TRC = 0.05 K; TRC |
Quantity | Value | Units | Method | Reference | Comment |
Tc | 567.0 ± 0.8 | K | N/A | Tsonopoulos and Ambrose, 1996 | |
Tc | 566.6 | K | N/A | Majer and Svoboda, 1985 | |
Tc | 566.55 | K | N/A | Ambrose, Cox, et al., 1960 | Uncertainty assigned by TRC = 0.05 K; Visual, PRT, IPTS-48, with decomp.; TRC |
Quantity | Value | Units | Method | Reference | Comment |
Pc | 26.8 ± 0.8 | bar | N/A | Tsonopoulos and Ambrose, 1996 | |
Quantity | Value | Units | Method | Reference | Comment |
Vc | 0.468 | l/mol | N/A | Tsonopoulos and Ambrose, 1996 | |
Quantity | Value | Units | Method | Reference | Comment |
ρc | 2.1 ± 0.08 | mol/l | N/A | Tsonopoulos and Ambrose, 1996 | |
Quantity | Value | Units | Method | Reference | Comment |
ΔvapH° | 40.44 | kJ/mol | N/A | Majer and Svoboda, 1985 | |
ΔvapH° | 40.6 | kJ/mol | CGC | Chickos, Hosseini, et al., 1995 | Based on data from 373. to 423. K.; AC |
ΔvapH° | 40.27 ± 0.20 | kJ/mol | C | Mansson, Sellers, et al., 1977 | ALS |
ΔvapH° | 40.3 ± 0.2 | kJ/mol | C | Månsson, Sellers, et al., 1977 | AC |
ΔvapH° | 38. | kJ/mol | N/A | Reid, 1972 | AC |
Enthalpy of vaporization
ΔvapH (kJ/mol) | Temperature (K) | Method | Reference | Comment |
---|---|---|---|---|
34.07 | 394.4 | N/A | Majer and Svoboda, 1985 | |
38.8 | 332. | A,MM | Stephenson and Malanowski, 1987 | Based on data from 317. to 395. K. See also Forziati, Camin, et al., 1950.; AC |
39.5 ± 0.1 | 313. | C | Svoboda, Charvátová, et al., 1982 | AC |
38.6 ± 0.1 | 328. | C | Svoboda, Charvátová, et al., 1982 | AC |
37.6 ± 0.1 | 343. | C | Svoboda, Charvátová, et al., 1982 | AC |
36.6 ± 0.1 | 358. | C | Svoboda, Charvátová, et al., 1982 | AC |
35.8 ± 0.1 | 368. | C | Svoboda, Charvátová, et al., 1982 | AC |
40.2 | 277. | MM | Chickos, Hyman, et al., 1981 | Based on data from 263. to 291. K.; AC |
41.2 | 275. | HSA | Chickos, Hyman, et al., 1981 | Based on data from 260. to 291. K.; AC |
Enthalpy of vaporization
ΔvapH =
A exp(-βTr) (1 − Tr)β
ΔvapH =
Enthalpy of vaporization (at saturation pressure)
(kJ/mol)
Tr = reduced temperature (T / Tc)
View plot Requires a JavaScript / HTML 5 canvas capable browser.
Temperature (K) | A (kJ/mol) | β | Tc (K) | Reference | Comment |
---|---|---|---|---|---|
298. to 368. | 57.49 | 0.2772 | 566.6 | Majer and Svoboda, 1985 |
Antoine Equation Parameters
log10(P) = A − (B / (T + C))
P = vapor pressure (bar)
T = temperature (K)
View plot Requires a JavaScript / HTML 5 canvas capable browser.
Temperature (K) | A | B | C | Reference |
---|---|---|---|---|
318.04 to 395.37 | 4.05752 | 1353.486 | -60.386 | Forziati, Camin, et al., 1950, 2 |
Enthalpy of fusion
ΔfusH (kJ/mol) | Temperature (K) | Reference | Comment |
---|---|---|---|
15.313 | 171.46 | McCullough, Finke, et al., 1957 | DH |
15.31 | 171.5 | Domalski and Hearing, 1996 | AC |
Entropy of fusion
ΔfusS (J/mol*K) | Temperature (K) | Reference | Comment |
---|---|---|---|
89.31 | 171.46 | McCullough, Finke, et al., 1957 | DH |

Reaction thermochemistry data

Data compiled by: Hussein Y. Afeefy, Joel F. Liebman, and Stephen E. Stein
Individual Reactions
By formula: C8H16 + H2 = C8H18
Quantity | Value | Units | Method | Reference | Comment |
---|---|---|---|---|---|
ΔrH° | -125. ± 6. | kJ/mol | AVG | N/A | Average of 7 values; Individual data points |
By formula: C8H18 = C8H16 + H2
Quantity | Value | Units | Method | Reference | Comment |
---|---|---|---|---|---|
ΔrH° | 125.52 | kJ/mol | Eqk | Eliseev, 1986 | liquid phase |

Gas phase ion energetics data

Data evaluated as indicated in comments:
L - Sharon G. Lias
Data compiled as indicated in comments:
LLK - Sharon G. Lias, Rhoda D. Levin, and Sherif A. Kafafi
RDSH - Henry M. Rosenstock, Keith Draxl, Bruce W. Steiner, and John T. Herron
Quantity | Value | Units | Method | Reference | Comment |
---|---|---|---|---|---|
IE (evaluated) | 9.43 ± 0.01 | eV | N/A | N/A | L |
Ionization energy determinations
IE (eV) | Method | Reference | Comment |
---|---|---|---|
9.427 ± 0.006 | PI | Rang, Martinson, et al., 1974 | LLK |
9.43 ± 0.01 | PI | Demeo and El-Sayed, 1970 | RDSH |
9.60 ± 0.01 | PE | Krause, Taylor, et al., 1978 | Vertical value; LLK |

Kovats' RI, non-polar column, isothermal

Column type | Active phase | Temperature (C) | I | Reference | Comment |
---|---|---|---|---|---|
Packed | PMS-1000 | 90. | 786. | Arutyunov, Kudryashov, et al., 2004 | N2, Chromaton N-AW-DMCS; Column length: 2. m |
Capillary | Petrocol DH | 30. | 788.3 | Soják, Addová, et al., 2004 | 150. m/0.25 mm/1. μm, H2 |
Capillary | Squalane | 30. | 780.4 | Soják, Addová, et al., 2004 | He; Column length: 93. m; Column diameter: 0.25 mm |
Packed | C78, Branched paraffin | 130. | 784.9 | Dallos, Sisak, et al., 2000 | He; Column length: 3.3 m |
Capillary | Squalane | 100. | 783. | Heinzen, Soares, et al., 1999 | |
Capillary | DB-1 | 140. | 789. | Beens, Tijssen, et al., 1998 | 10. m/0.25 mm/0.25 μm, He |
Capillary | DB-1 | 60. | 788. | Beens, Tijssen, et al., 1998 | 10. m/0.25 mm/0.25 μm, He |
Capillary | Squalane | 25. | 780. | Hilal, Carreira, et al., 1994 | |
Packed | C78, Branched paraffin | 130. | 785.3 | Reddy, Dutoit, et al., 1992 | Chromosorb G HP; Column length: 3.3 m |
Packed | Apolane | 130. | 786. | Dutoit, 1991 | Column length: 3.7 m |
Capillary | Methyl Silicone | 40. | 788. | Takeda, 1991 | Column length: 50. m; Column diameter: 0.20 mm |
Capillary | Methyl Silicone | 80. | 789. | Takeda, 1991 | Column length: 50. m; Column diameter: 0.20 mm |
Capillary | OV-101 | 40. | 788. | Laub and Purnell, 1988 | |
Capillary | OV-101 | 60. | 789. | Laub and Purnell, 1988 | |
Capillary | OV-101 | 80. | 789. | Laub and Purnell, 1988 | |
Capillary | OV-101 | 110. | 789. | Rang, Kuningas, et al., 1987 | He; Column length: 50. m; Column diameter: 0.25 mm |
Capillary | OV-101 | 50. | 788.3 | Boneva and Dimov, 1986 | 100. m/0.27 mm/0.9 μm, N2 |
Capillary | OV-101 | 70. | 789. | Boneva and Dimov, 1986 | 100. m/0.27 mm/0.9 μm, N2 |
Capillary | Squalane | 50. | 781. | Boneva and Dimov, 1986 | N2; Column length: 100. m; Column diameter: 0.25 mm |
Capillary | Squalane | 70. | 781.8 | Boneva and Dimov, 1986 | N2; Column length: 100. m; Column diameter: 0.25 mm |
Capillary | OV-1 | 100. | 789.0 | Anders, Anders, et al., 1985 | 55. m/0.21 mm/0.35 μm, N2 |
Packed | SE-30 | 42. | 788. | Rudenko, Mal'tsev, et al., 1985 | Column length: 3. m |
Capillary | DB-1 | 40. | 788. | Lubeck and Sutton, 1984 | 60. m/0.264 mm/0.25 μm, H2 |
Capillary | HP-PONA | 40. | 788. | Lubeck and Sutton, 1984 | 50. m/0.21 mm/0.5 μm, H2 |
Packed | SE-30 | 150. | 790. | Tiess, 1984 | Ar, Gas Chrom Q (80-100 mesh); Column length: 3. m |
Capillary | OV-3 | 30. | 792.5 | Chien, Furio, et al., 1983 | |
Capillary | OV-3 | 40. | 792.6 | Chien, Furio, et al., 1983 | |
Capillary | OV-3 | 50. | 792.7 | Chien, Furio, et al., 1983 | |
Capillary | OV-3 | 60. | 792.8 | Chien, Furio, et al., 1983 | |
Capillary | OV-3 | 70. | 792.9 | Chien, Furio, et al., 1983 | |
Capillary | OV-3 | 80. | 793.0 | Chien, Furio, et al., 1983 | |
Packed | SE-30 | 100. | 790. | Winskowski, 1983 | Gaschrom Q; Column length: 2. m |
Capillary | SE-30 | 130. | 789. | Bredael, 1982 | Column length: 100. m; Column diameter: 0.5 mm |
Capillary | SE-30 | 80. | 789. | Bredael, 1982 | Column length: 100. m; Column diameter: 0.5 mm |
Capillary | OV-1 | 30. | 788.4 | Chien, Kopecni, et al., 1981 | H2 |
Capillary | OV-1 | 40. | 788.6 | Chien, Kopecni, et al., 1981 | H2 |
Capillary | OV-1 | 50. | 788.8 | Chien, Kopecni, et al., 1981 | H2 |
Capillary | OV-1 | 60. | 789. | Chien, Kopecni, et al., 1981 | H2 |
Capillary | OV-1 | 70. | 786.7 | Chien, Kopecni, et al., 1981 | H2 |
Capillary | OV-1 | 80. | 789.4 | Chien, Kopecni, et al., 1981 | H2 |
Capillary | SE-30 | 30. | 788.1 | Chien, Kopecni, et al., 1981 | H2 |
Capillary | SE-30 | 40. | 787.7 | Chien, Kopecni, et al., 1981 | H2 |
Capillary | SE-30 | 50. | 787.6 | Chien, Kopecni, et al., 1981 | H2 |
Capillary | SE-30 | 60. | 787.3 | Chien, Kopecni, et al., 1981 | H2 |
Capillary | SE-30 | 70. | 787. | Chien, Kopecni, et al., 1981 | H2 |
Capillary | SE-30 | 80. | 786.6 | Chien, Kopecni, et al., 1981 | H2 |
Capillary | OV-1 | 60. | 790. | Nijs and Jacobs, 1981 | He; Column length: 150. m; Column diameter: 0.50 mm |
Capillary | Squalane | 50. | 781.6 | Welsch, Engewald, et al., 1978 | Column length: 80. m; Column diameter: 0.23 mm |
Packed | Squalane | 80. | 782. | Chrétien and Dubois, 1977 | |
Capillary | Squalane | 50. | 781. | Chretien and Dubois, 1976 | |
Capillary | Squalane | 100. | 782.6 | Lulova, Leont'eva, et al., 1976 | He; Column length: 120. m; Column diameter: 0.25 mm |
Capillary | Squalane | 100. | 784. | Lulova, Leont'eva, et al., 1976 | He; Column length: 120. m; Column diameter: 0.25 mm |
Packed | Apolane | 70. | 783.7 | Riedo, Fritz, et al., 1976 | He, Chromosorb; Column length: 2.4 m |
Capillary | Squalane | 60. | 782. | Ryba, 1976 | Column length: 50. m; Column diameter: 0.25 mm |
Capillary | Squalane | 60. | 782. | Ryba, 1976 | Column length: 50. m; Column diameter: 0.25 mm |
Capillary | Squalane | 55. | 784. | Lulova, Leont'eva, et al., 1975 | He; Column length: 120. m; Column diameter: 0.25 mm |
Packed | Squalane | 100. | 784. | Vernon and Edwards, 1975 | N2, DCMS-treated Celite; Column length: 1. m |
Capillary | Squalane | 50. | 781. | Rijks and Cramers, 1974 | N2; Column length: 100. m; Column diameter: 0.25 mm |
Capillary | Squalane | 70. | 782. | Rijks and Cramers, 1974 | N2; Column length: 100. m; Column diameter: 0.25 mm |
Capillary | OV-101 | 50. | 788. | Pacáková, Hoch, et al., 1973 | 25. m/0.25 mm/1.39 μm, N2 |
Capillary | OV-101 | 60. | 788. | Pacáková, Hoch, et al., 1973 | 25. m/0.25 mm/1.39 μm, N2 |
Capillary | Squalane | 80. | 782.67 | Schomburg and Dielmann, 1973 | Column length: 100. m; Column diameter: 0.25 mm |
Capillary | Squalane | 80. | 782.67 | Schomburg and Dielmann, 1973, 2 | Column length: 100. m; Column diameter: 0.25 mm |
Capillary | Squalane | 80. | 782.7 | Schomburg and Dielmann, 1973, 2 | Column length: 100. m; Column diameter: 0.25 mm |
Capillary | Squalane | 100. | 783. | Sojak, Hrivnak, et al., 1973 | |
Capillary | Squalane | 115. | 783. | Sojak, Hrivnak, et al., 1973 | |
Capillary | Squalane | 86. | 782. | Sojak, Hrivnak, et al., 1973 | |
Capillary | Apiezon L | 100. | 789.2 | Eisen, Orav, et al., 1972 | Column length: 45. m; Column diameter: 0.25 mm |
Capillary | Squalane | 80. | 781.4 | Eisen, Orav, et al., 1972 | Column length: 80. m; Column diameter: 0.25 mm |
Capillary | Squalane | 80. | 781. | Orav and Eisen, 1972 | Column length: 80. m; Column diameter: 0.25 mm |
Capillary | Squalane | 115. | 782.9 | Soják and Bucinská, 1970 | N2; Column length: 200. m; Column diameter: 0.2 mm |
Capillary | Squalane | 86. | 782.3 | Soják and Bucinská, 1970 | N2; Column length: 200. m; Column diameter: 0.2 mm |
Capillary | Squalane | 40. | 783. | Matukuma, 1969 | N2; Column length: 91.4 m; Column diameter: 0.25 mm |
Packed | Apiezon L | 100. | 786. | Brown, Chapman, et al., 1968 | N2, DCMS-treated Chromosorb W; Column length: 2.3 m |
Packed | Apiezon L | 150. | 790. | Brown, Chapman, et al., 1968 | N2, DCMS-treated Chromosorb W; Column length: 2.3 m |
Capillary | Squalane | 70. | 782. | Schomburg, 1967 | Ar; Column length: 100. m |
Packed | Apiezon L | 130. | 783. | Wehrli and Kováts, 1959 | Celite; Column length: 2.25 m |
Packed | Apiezon L | 190. | 779. | Wehrli and Kováts, 1959 | Celite; Column length: 2.25 m |

Kovats' RI, non-polar column, temperature ramp

Column type | Active phase | I | Reference | Comment |
---|---|---|---|---|
Capillary | DB-1 | 785. | Takeoka, Perrino, et al., 1996 | 60. m/0.25 mm/0.25 μm, 30. C @ 4. min, 2. K/min; Tend: 220. C |
Capillary | DB-1 | 790. | Takeoka, Perrino, et al., 1996 | 60. m/0.25 mm/0.25 μm, 30. C @ 4. min, 2. K/min; Tend: 220. C |
Capillary | SE-54 | 790. | Rembold, Wallner, et al., 1989 | 30. m/0.25 mm/0.25 μm, He, 0. C @ 12. min, 12. K/min; Tend: 250. C |
Capillary | OV-101 | 791. | Ohnishi and Shibamoto, 1984 | 2. K/min; Column length: 50. m; Column diameter: 0.23 mm; Tstart: 80. C; Tend: 200. C |
Capillary | OV-101 | 795. | Ohnishi and Shibamoto, 1984 | 2. K/min; Column length: 50. m; Column diameter: 0.23 mm; Tstart: 80. C; Tend: 200. C |
Capillary | OV-101 | 786. | Hayes and Pitzer, 1982 | 110. m/0.25 mm/0.20 μm, He, 1. K/min; Tstart: 35. C; Tend: 200. C |

Kovats' RI, non-polar column, custom temperature program

Column type | Active phase | I | Reference | Comment |
---|---|---|---|---|
Capillary | DB-5MS | 796. | Tuberoso, Kowalczyk, et al., 2005 | 30. m/0.25 mm/0.25 μm, He; Program: 60C(5min) => 2C/min => 140C= 5C/min => 250C(5min) |
Capillary | Petrocol DH-100 | 787.72 | Haagen-Smit Laboratory, 1997 | He; Column length: 100. m; Column diameter: 0.2 mm; Program: 5C(10min) => 5C/min => 50C(48min) => 1.5C/min => 195C(91min) |
Capillary | DB-1 | 790. | Hoekman, 1993 | 60. m/0.32 mm/1.0 μm, He; Program: -40 C for 12 min; -40 - 125 C at 3 deg.min; 125-185 C at 6 deg/min; 185 - 220 C at 20 deg/min; hold 220 C for 2 min |

Kovats' RI, polar column, isothermal

Column type | Active phase | Temperature (C) | I | Reference | Comment |
---|---|---|---|---|---|
Capillary | PEG 4000 | 100. | 851. | Rang, Orav, et al., 1988 | |
Capillary | PEG 4000 | 110. | 852. | Rang, Orav, et al., 1988 | |
Capillary | PEG 4000 | 60. | 847. | Rang, Orav, et al., 1988 | |
Capillary | PEG 4000 | 70. | 847. | Rang, Orav, et al., 1988 | |
Capillary | PEG 4000 | 80. | 850. | Rang, Orav, et al., 1988 | |
Capillary | Polyethylene Glycol 4000 | 100. | 848.5 | Eisen, Orav, et al., 1972 | Column length: 80. m; Column diameter: 0.25 mm |
Capillary | Polyethylene Glycol 4000 | 60. | 847.4 | Eisen, Orav, et al., 1972 | Column length: 80. m; Column diameter: 0.25 mm |
Capillary | Polyethylene Glycol 4000 | 70. | 847.2 | Eisen, Orav, et al., 1972 | Column length: 80. m; Column diameter: 0.25 mm |
Capillary | Polyethylene Glycol 4000 | 80. | 849.9 | Eisen, Orav, et al., 1972 | Column length: 80. m; Column diameter: 0.25 mm |
Capillary | PEG 4000 | 70. | 847.2 | Orav and Eisen, 1972 | Column length: 80. m; Column diameter: 0.25 mm |
Capillary | PEG 4000 | 100. | 848.5 | Orav and Eisen, 1972 | Column length: 80. m; Column diameter: 0.25 mm |
Capillary | PEG 4000 | 60. | 847.4 | Orav and Eisen, 1972 | Column length: 80. m; Column diameter: 0.25 mm |
Capillary | PEG 4000 | 80. | 849.9 | Orav and Eisen, 1972 | Column length: 80. m; Column diameter: 0.25 mm |

Kovats' RI, polar column, temperature ramp

Column type | Active phase | I | Reference | Comment |
---|---|---|---|---|
Capillary | DB-Wax | 842. | Umano and Shibamoto, 1987 | He, 40. C @ 10. min, 2. K/min; Column length: 60. m; Column diameter: 0.25 mm; Tend: 200. C |

Van Den Dool and Kratz RI, non-polar column, temperature ramp

Column type | Active phase | I | Reference | Comment |
---|---|---|---|---|
Capillary | RTX-5 | 792.9 | Ádámová, Orinák, et al., 2005 | 30. m/0.25 mm/0.25 μm, N2, 40. C @ 2. min, 5. K/min, 300. C @ 10. min |
Capillary | CP-Sil 8CB-MS | 789. | Elmore, Cooper, et al., 2005 | 0. m/0.25 mm/0.25 μm, He, 40. C @ 2. min, 4. K/min, 280. C @ 5. min |
Capillary | HP-5 | 794. | Insausti, Goñi, et al., 2005 | 50. m/0.32 mm/1.05 μm, He, 35. C @ 15. min, 8. K/min, 220. C @ 5. min |
Capillary | CP-Sil 8CB-MS | 792. | Hierro, de la Hoz, et al., 2004 | 60. m/0.25 mm/0.25 μm, 40. C @ 2. min, 4. K/min, 280. C @ 5. min |
Capillary | DB-1 | 785. | de Feo, Urrunaga Soria, et al., 2003 | 30. m/0.25 mm/0.25 μm, He, 40. C @ 5. min, 2. K/min; Tend: 250. C |
Capillary | SPB-1 | 782.40 | LECO Corporation, 2003 | 30. m/0.25 mm/0.25 μm, 40. C @ 2. min, 10. K/min, 250. C @ 2. min |
Capillary | DB-5 | 789.3 | Song, Lai, et al., 2003 | 30. m/0.25 mm/0.25 μm, He, 4. K/min; Tstart: 40. C; Tend: 310. C |
Capillary | DB-5 | 788.4 | Song, Lai, et al., 2003 | 30. m/0.25 mm/0.25 μm, He, 40. C @ 5. min, 4. K/min; Tend: 310. C |
Capillary | DB-5 | 788.3 | Song, Lai, et al., 2003 | 30. m/0.25 mm/0.25 μm, He, 2. K/min; Tstart: 40. C; Tend: 310. C |
Capillary | DB-5 | 789.3 | Song, Lai, et al., 2003 | 30. m/0.25 mm/0.25 μm, He, 4. K/min; Tstart: 40. C; Tend: 310. C |
Capillary | DB-5 | 789.1 | Song, Lai, et al., 2003 | 30. m/0.25 mm/0.25 μm, He, 6. K/min; Tstart: 40. C; Tend: 310. C |
Capillary | DB-5 | 789.6 | Xu, van Stee, et al., 2003 | 30. m/0.25 mm/1. μm, He, 2.5 K/min; Tstart: 50. C; Tend: 200. C |
Capillary | DB-1 | 788.4 | Helmig, Klinger, et al., 1999 | 60. m/0.32 mm/1. μm, -50. C @ 2. min, 6. K/min; Tend: 175. C |
Capillary | DB-1 | 785. | Beens, Tijssen, et al., 1998 | 10. m/0.25 mm/0.25 μm, He, 2. K/min; Tstart: 30. C; Tend: 225. C |
Capillary | DB-1 | 789.7 | Helmig, Pollock, et al., 1996 | 30. m/0.25 mm/1. μm, 6. K/min; Tstart: -50. C; Tend: 180. C |
Capillary | DB-5 | 788.3 | Lai and Song, 1995 | 30. m/0.25 mm/0.25 μm, He, 2. K/min; Tstart: 40. C; Tend: 310. C |
Capillary | DB-5 | 789.3 | Lai and Song, 1995 | 30. m/0.25 mm/0.25 μm, He, 4. K/min; Tstart: 40. C; Tend: 310. C |
Capillary | DB-5 | 789.1 | Lai and Song, 1995 | 30. m/0.25 mm/0.25 μm, He, 6. K/min; Tstart: 40. C; Tend: 310. C |
Capillary | DB-5 | 789.3 | Lai and Song, 1995 | 30. m/0.25 mm/0.25 μm, He, 4. K/min; Tstart: 40. C; Tend: 310. C |
Capillary | DB-5 | 788.4 | Lai and Song, 1995 | 30. m/0.25 mm/0.25 μm, He, 40. C @ 5. min, 4. K/min; Tend: 310. C |
Capillary | Petrocol DH | 787. | White, Hackett, et al., 1992 | 100. m/0.25 mm/0.5 μm, He, 1. K/min; Tstart: 30. C; Tend: 220. C |
Capillary | Methyl Silicone | 787. | Takeda, 1991 | 20. C @ 5. min, 2. K/min; Column length: 50. m; Column diameter: 0.20 mm; Tend: 250. C |
Capillary | Ultra-1 | 789.04 | Haynes and Pitzer, 1985 | 50. m/0.22 mm/0.33 μm, He, 1. K/min; Tstart: -30. C; Tend: 240. C |
Capillary | Ultra-1 | 788.99 | Haynes and Pitzer, 1985 | 50. m/0.22 mm/0.33 μm, He, 2. K/min; Tstart: -30. C; Tend: 240. C |
Capillary | Ultra-1 | 789.05 | Haynes and Pitzer, 1985 | 50. m/0.22 mm/0.33 μm, He, 3. K/min; Tstart: -30. C; Tend: 240. C |
Capillary | Ultra-2 | 791.72 | Haynes and Pitzer, 1985 | 50. m/0.22 mm/0.33 μm, He, 1. K/min; Tstart: -30. C; Tend: 240. C |
Capillary | Ultra-2 | 791.76 | Haynes and Pitzer, 1985 | 50. m/0.22 mm/0.33 μm, He, 2. K/min; Tstart: -30. C; Tend: 240. C |
Capillary | Ultra-2 | 791.77 | Haynes and Pitzer, 1985 | 50. m/0.22 mm/0.33 μm, He, 3. K/min; Tstart: -30. C; Tend: 240. C |
Capillary | OV-101 | 786. | Hayes and Pitzer, 1981 | 108. m/0.25 mm/0.2 μm, 1. K/min; Tstart: 35. C; Tend: 200. C |
Capillary | Chromosorb 101 | 799. | Voorhees, Hileman, et al., 1975 | 10. K/min; Tstart: 0. C; Tend: 220. C |

Van Den Dool and Kratz RI, non-polar column, custom temperature program

Column type | Active phase | I | Reference | Comment |
---|---|---|---|---|
Capillary | DB-5 | 789. | Zaikin and Borisov, 2002 | He; Column length: 30. m; Column diameter: 0.25 mm; Program: 30C => 5K/min=120C => 10C/min => 270C |
Packed | SE-30 | 792. | Peng, Ding, et al., 1988 | Supelcoport; Chromosorb; Column length: 3.05 m; Program: 40C(5min) => 10C/min => 200C or 250C (60min) |

Van Den Dool and Kratz RI, polar column, temperature ramp

Column type | Active phase | I | Reference | Comment |
---|---|---|---|---|
Capillary | Supelcowax-10 | 837. | Elmore, Nisyrios, et al., 2005 | 60. m/0.25 mm/0.25 μm, He, 40. C @ 2. min, 4. K/min; Tend: 280. C |

Van Den Dool and Kratz RI, polar column, custom temperature program

Column type | Active phase | I | Reference | Comment |
---|---|---|---|---|
Capillary | DB-Wax | 833. | Radovic, Careri, et al., 2001 | 30. m/0.25 mm/0.25 μm; Program: 30C(8min) => 4C/min => 60C => 6C/min => 160C => 20C/min => 200C(1min) |

Normal alkane RI, non-polar column, isothermal

Column type | Active phase | Temperature (C) | I | Reference | Comment |
---|---|---|---|---|---|
Capillary | Methyl Silicone | 50. | 782. | N/A | N2; Column length: 74.6 m; Column diameter: 0.28 mm |
Capillary | Squalane | 70. | 782. | Schomburg, 1966 | |
Packed | Squalane | 75. | 782. | Swoboda and Lea, 1965 | Celite (80-100 mesh); Column length: 1. m |
Packed | Polydimethyl siloxane | 110. | 787. | Ferrand, 1962 |

Normal alkane RI, non-polar column, temperature ramp

Column type | Active phase | I | Reference | Comment |
---|---|---|---|---|
Capillary | Polydimethyl siloxane: CP-Sil 5 CB | 792. | Bramston-Cook, 2013 | 60. m/0.25 mm/1.0 μm, Helium, 45. C @ 1.45 min, 3.6 K/min, 210. C @ 2.72 min |
Capillary | Petrocol DH | 787. | Supelco, 2012 | 100. m/0.25 mm/0.50 μm, Helium, 20. C @ 15. min, 15. K/min, 220. C @ 30. min |
Capillary | VF-5 MS | 789. | Leffingwell and Alford, 2011 | 60. m/0.32 mm/0.25 μm, Helium, 2. K/min, 260. C @ 28. min; Tstart: 30. C |
Capillary | VF-5 MS | 792. | Leffingwell and Alford, 2011 | 60. m/0.32 mm/0.25 μm, Helium, 2. K/min, 260. C @ 28. min; Tstart: 30. C |
Capillary | HP-5 MS | 796. | Miyazawa, Marumoto, et al., 2011 | 30. m/0.25 mm/0.25 μm, Helium, 4. K/min, 260. C @ 5. min; Tstart: 40. C |
Capillary | Ultra-ALLOY-5 | 790. | Tsuge, Ohtan, et al., 2011 | 30. m/0.25 mm/0.25 μm, 40. C @ 2. min, 20. K/min, 320. C @ 13. min |
Capillary | Ultra-ALLOY-5 | 791. | Tsuge, Ohtan, et al., 2011 | 30. m/0.25 mm/0.25 μm, 40. C @ 2. min, 20. K/min, 320. C @ 13. min |
Capillary | HP-5 | 793. | Miyazawa, Kawauchi, et al., 2010 | 30. m/0.25 mm/0.25 μm, Helium, 4. K/min, 260. C @ 5. min; Tstart: 40. C |
Capillary | DB-5 | 792. | El-Massry, El-Ghorab, et al., 2009 | 30. m/0.25 mm/0.25 μm, Helium, 3. K/min, 220. C @ 40. min; Tstart: 35. C |
Capillary | HP-5 | 794. | Mildner-Szkudlarz and Jelen, 2008 | 10. m/0.10 mm/0.40 μm, Helium, 40. C @ 1. min, 20. K/min, 280. C @ 1. min |
Capillary | HP-1 | 786. | Berlioz, Cordella, et al., 2006 | 50. m/0.2 mm/0.33 μm, N2, 2. K/min, 250. C @ 20. min; Tstart: 60. C |
Capillary | Petrocol DH | 788. | Sojak, Kubinec, et al., 2006 | 150. m/0.25 mm/1.0 μm, 1. K/min; Tstart: 40. C; Tend: 300. C |
Capillary | Petrocol DH | 788. | Sojak, Kubinec, et al., 2006 | 150. m/0.25 mm/1.0 μm, 1. K/min; Tstart: 40. C; Tend: 300. C |
Capillary | Petrocol DH | 788. | Sojak, Kubinec, et al., 2006 | 150. m/0.25 mm/1.0 μm, 1. K/min; Tstart: 40. C; Tend: 300. C |
Capillary | Petrocol DH | 788. | Sojak, Kubinec, et al., 2006 | 150. m/0.25 mm/1.0 μm, 1. K/min; Tstart: 40. C; Tend: 300. C |
Capillary | MDN-5 | 790. | van Loon, Linssen, et al., 2005 | 60. m/0.25 mm/0.25 μm, He, 40. C @ 4. min, 4. K/min, 270. C @ 5. min |
Capillary | MDN-5 | 794. | Mildner-Szkudlarz, Jelen, et al., 2003 | 30. m/0.25 mm/0.25 μm, He, 40. C @ 1. min, 20. K/min, 280. C @ 1. min |
Capillary | SPB-5 | 799. | Sebastian, Viallon-Fernandez, et al., 2003 | 60. m/0.32 mm/1.0 μm, Helium, 3. K/min; Tstart: 30. C; Tend: 230. C |
Capillary | SPB-1 | 783. | Vichi, Pizzale, et al., 2003 | 30. m/0.25 mm/0.25 μm, He, 40. C @ 10. min, 3. K/min; Tend: 200. C |
Capillary | SPB-1 | 785. | Vichi, Pizzale, et al., 2003, 2 | 30. m/0.25 mm/0.25 μm, He, 40. C @ 10. min, 3. K/min; Tend: 200. C |
Capillary | HP-5 | 799. | García, Martín, et al., 2000 | 60. m/0.32 mm/1. μm, He, 3. K/min; Tstart: 40. C; Tend: 240. C |
Capillary | DB-5MS | 788.2 | Shoenmakers, Oomen, et al., 2000 | 30. m/0.25 mm/0.25 μm, He, 40. C @ 1. min, 3. K/min; Tend: 250. C |
Capillary | Methyl Silicone | 788.04 | Baraldi, Rapparini, et al., 1999 | 60. m/0.25 mm/0.25 μm, 40. C @ 10. min, 5. K/min; Tend: 220. C |
Capillary | DB-5 | 792. | Meynier, Novelli, et al., 1999 | 30. m/0.32 mm/1. μm, 40. C @ 5. min, 3. K/min; Tend: 200. C |
Capillary | OV-101 | 788. | Orav, Kailas, et al., 1999 | 50. m/0.20 mm/0.50 μm, Helium, 30. C @ 6. min, 1. K/min; Tend: 100. C |
Capillary | DB-5 | 789. | Kondjoyan, Viallon, et al., 1997 | 60. m/0.32 mm/1. μm, 40. C @ 5. min, 3. K/min, 200. C @ 2. min |
Capillary | DB-5 | 792. | Kondjoyan, Viallon, et al., 1997 | 60. m/0.32 mm/1. μm, 40. C @ 5. min, 3. K/min, 200. C @ 2. min |
Capillary | HP-5 | 791. | Larsen and Frisvad, 1995 | 35. C @ 2. min, 6. K/min; Tend: 200. C |
Capillary | HP-5 | 791. | Larsen and Frisvad, 1995, 2 | 35. C @ 2. min, 6. K/min; Tend: 200. C |
Capillary | DB-5 | 792. | Macku and Shibamoto, 1991 | He, 40. C @ 5. min, 2. K/min; Column length: 60. m; Column diameter: 0.25 mm; Tend: 160. C |
Capillary | OV-101 | 789. | Zenkevich and Ventura, 1991 | Helium, 50. C @ 0. min, 5. K/min, 240. C @ 0. min; Column length: 54. m; Column diameter: 0.26 mm |
Capillary | SE-30 | 788. | Hackett, Gibbon, et al., 1985 | He, 20. C @ 4. min, 2. K/min, 260. C @ 16. min; Column length: 50. m; Column diameter: 0.25 mm |
Capillary | SP-2100 | 788. | Alencar, Alves, et al., 1983 | He, 4. K/min; Column length: 30. m; Column diameter: 0.25 mm; Tstart: 40. C; Tend: 250. C |
Packed | Apiezon L | 779. | Dahlmann, Köser, et al., 1979 | Chromosorb G-AW-DMCS, 10. K/min; Column length: 2. m; Tstart: 25. C |

Normal alkane RI, non-polar column, custom temperature program

Column type | Active phase | I | Reference | Comment |
---|---|---|---|---|
Capillary | DB-5 | 792. | Yusuf and Bewaji, 2011 | Column length: 30. m; Column diameter: 0.32 mm; Program: not specified |
Capillary | SLB-5 MS | 788. | Costa, De Fina, et al., 2008 | 30. m/0.25 mm/0.25 μm, Helium; Program: 50 0C 3 0C/min -> 250 0C (1 min) 10 0C/min -> 300 0C (5 min) |
Capillary | SLB-5 MS | 788. | Costa, De Fina, et al., 2008 | 30. m/0.25 mm/0.25 μm, Helium; Program: not specified |
Capillary | HP-1 | 783. | Barra, Baldovini, et al., 2007 | 50. m/0.2 mm/0.33 μm, He; Program: 40C(2min) => 2C/min => 200C => 15C/min => 250C (30min) |
Capillary | DB-5 MS | 792. | Liu, Xu, et al., 2007 | 60. m/0.32 mm/1.0 μm, Helium; Program: 40 0C (2 min) 6 0C/min -> 100 0C 4 0C/min -> 180 0C 8 0C/min -> 250 0C (12 min) |
Capillary | HP-1 | 793. | Merle, Verdeguer, et al., 2007 | 30. m/0.2 mm/0.33 μm, He; Program: 60C(5min) => 3C/min => 180C => 20C/min => 280C(10min) |
Capillary | DB-5 | 788. | Pellicer, 2007 | 30. m/0.32 mm/0.25 μm, Helium; Program: not specified |
Capillary | DB-5 | 790. | Pellicer, 2007 | 30. m/0.32 mm/0.25 μm, Helium; Program: not specified |
Capillary | RTX-5 | 790. | Ádámová, Orinák, et al., 2005 | 30. m/0.25 mm/0.25 μm, N2; Program: not specified |
Capillary | Methyl Silicone | 789. | Blunden, Aneja, et al., 2005 | 60. m/0.32 mm/1.0 μm, Helium; Program: -50 0C (2 min) 8 0C/min -> 200 0C (7.75 min) 25 0C -> 225 0C (8 min) |
Capillary | CP-Sil5 CB MS | 788. | Iraqi, Vermeulen, et al., 2005 | 50. m/0.32 mm/1.2 μm; Program: 36C(2min) => 20C/min => 85C => 1C/min => 145C => 3C/min => 250C(30min) |
Capillary | MDN-5 | 784. | Jelen and Grabarkiewicz-Szczesna, 2005 | 30. m/0.25 mm/0.25 μm; Program: not specified |
Capillary | HP-5 | 792. | Garcia-Estaban, Ansorena, et al., 2004 | 50. m/0.32 mm/1.05 μm; Program: 40C(10min) => 5C/min => 200C => 20C/min => 250C(5min) |
Capillary | DB-5 | 792. | Garcia-Estaban, Ansorena, et al., 2004, 2 | 50. m/0.32 mm/1.05 μm; Program: 40C(10min) => 5C/min => 200C => 20C/min => 250C (5min) |
Capillary | SE-30 | 797. | Vinogradov, 2004 | Program: not specified |
Capillary | Polydimethyl siloxane | 783. | Junkes, Castanho, et al., 2003 | Program: not specified |
Capillary | BPX-5 | 790. | Machiels, van Ruth, et al., 2003 | 60. m/0.32 mm/1. μm, He; Program: 40C (4min) => 2C/min => 90C => 4C/min => 130C => 8C/min => 250 C (10min) |
Capillary | BP-1 | 784.90 | Cooke, Hassoun, et al., 2001 | 50. m/0.25 mm/1. μm, He; Program: -50C => 49.9C/min => 5C(3min) => 3C/min => 50C => 5C/min => 220C(20 min) |
Capillary | Methyl Silicone | 783. | N/A | Program: not specified |
Capillary | DB-1 | 788. | Zhu and Wang, 2001 | Program: not specified |
Capillary | Methyl Silicone | 787. | Spieksma, 1999 | Program: not specified |
Capillary | SPB-1 | 790. | Flanagan, Streete, et al., 1997 | 60. m/0.53 mm/5. μm, He; Program: 40C(6min) => 5C/min => 80C => 10C/min => 200C |
Capillary | DB-1 | 788. | Ciccioli, Cecinato, et al., 1994 | 60. m/0.32 mm/0.25 μm; Program: not specified |
Capillary | DB-1 | 788. | Ciccioli, Brancaleoni, et al., 1993 | 60. m/0.32 mm/0.25 μm; Program: 3 min at 5 C; 5 - 50 C at 3 deg/min; 50 - 220 C at 5 deg/min |
Capillary | DB-5 | 795. | Jean, Garneau, et al., 1993 | Column length: 30. m; Column diameter: 0.25 mm; Program: not specified |
Capillary | SPB-1 | 790. | Strete, Ruprah, et al., 1992 | 60. m/0.53 mm/5.0 μm, Helium; Program: 40 0C (6 min) 5 0C/min -> 80 0C 10 0C/min -> 200 0C |
Capillary | SPB-1 | 790. | Strete, Ruprah, et al., 1992 | 60. m/0.53 mm/5.0 μm, Helium; Program: not specified |
Capillary | OV-101 | 786. | Zenkevich and Malamakhov, 1987 | He; Column length: 50. m; Column diameter: 0.24 mm; Program: not specified |
Packed | Squalane | 785. | Swoboda and Lea, 1965 | Celite (80-100 mesh); Column length: 1. m; Program: not specified |

Normal alkane RI, polar column, temperature ramp

Column type | Active phase | I | Reference | Comment |
---|---|---|---|---|
Capillary | Supelcowax-10 | 836. | Vichi, Pizzale, et al., 2003 | 30. m/0.25 mm/0.25 μm, He, 40. C @ 10. min, 3. K/min; Tend: 200. C |
Capillary | Supelcowax-10 | 837. | Vichi, Pizzale, et al., 2003, 2 | 30. m/0.25 mm/0.25 μm, He, 40. C @ 10. min, 3. K/min; Tend: 200. C |
Capillary | DB-Wax | 892. | Umano, Hagi, et al., 2000 | 60. m/0.25 mm/0.25 μm, He, 40. C @ 2. min, 2. K/min; Tend: 200. C |
Capillary | DB-Wax | 850. | Horiuchi, Umano, et al., 1998 | 60. m/0.25 mm/1. μm, He, 3. K/min, 200. C @ 40. min; Tstart: 50. C |
Capillary | DB-Wax | 822. | Chung, Eiserich, et al., 1993 | 60. C @ 4. min, 3. K/min; Column length: 60. m; Column diameter: 0.25 mm; Tend: 220. C |

Normal alkane RI, polar column, custom temperature program

Column type | Active phase | I | Reference | Comment |
---|---|---|---|---|
Capillary | Supelcowax 10 | 830. | Soria, Martinez-Castro, et al., 2008 | 50. m/0.25 mm/0.25 μm, Helium; Program: 45 0C (15 min) 3 0C/min -> 75 0C 5 0C/min -> 180 0C (10 min) |
Capillary | Carbowax 20M | 830. | Vinogradov, 2004 | Program: not specified |
Capillary | DB-Wax | 831. | Peng, Yang, et al., 1991 | Program: not specified |
Capillary | Carbowax 20M | 830. | Ramsey and Flanagan, 1982 | Program: not specified |

Henry's Law data

Data compiled by: Rolf Sander
Henry's Law constant (water solution)
kH(T) = k°H exp(d(ln(kH))/d(1/T) ((1/T) - 1/(298.15 K)))
k°H = Henry's law constant for solubility in water at 298.15 K (mol/(kg*bar))
d(ln(kH))/d(1/T) = Temperature dependence constant (K)
k°H (mol/(kg*bar)) | d(ln(kH))/d(1/T) (K) | Method | Reference | Comment |
---|---|---|---|---|
0.0016 | Q | N/A | missing citation give several references for the Henry's law constants but don't assign them to specific species. | |
0.0011 | L | N/A | ||
0.0011 | V | N/A |

References

Bretschneider and Rogers, 1970
Bretschneider, E.; Rogers, D.W.,
A new microcalorimeter: heats of hydrogenation of four monoolefins,
Mikrochim. Acta, 1970, 482-490. [all data]
Rockenfeller and Rossini, 1961
Rockenfeller, J.D.; Rossini, F.D.,
Heats of combustion, isomerization, and formation of selected C7, C8, and C10 monoolefin hydrocarbons,
J. Phys. Chem., 1961, 65, 267-272. [all data]
Cox and Pilcher, 1970
Cox, J.D.; Pilcher, G.,
Thermochemistry of Organic and Organometallic Compounds, Academic Press, New York, 1970, 1-636. [all data]
McCullough, Finke, et al., 1957
McCullough, J.P.; Finke, H.L.; Gross, M.E.; Messerly, J.F.; Waddington, G.,
Low temperature calorimetric studies of seven 1-olefins: effect of orientational disorder in the solid state,
J. Phys. Chem., 1957, 61, 289-301. [all data]
McCullough, Finke, et al., 1957, 2
McCullough, J.P.; Finke, H.L.; Gross, M.E.; Messerly, J.F.; Waddington, G.,
Low temperature calorimetric studies of seven 1-olefins: effect of orientational disorder in the solid state,
J. Phys. Chem., 1957, 61, 289. [all data]
Tsonopoulos and Ambrose, 1996
Tsonopoulos, C.; Ambrose, D.,
Vapor-Liquid Critical Properties of Elements and Compounds. 6. Unsaturated Aliphatic Hydrocarbons,
J. Chem. Eng. Data, 1996, 41, 645-656. [all data]
Majer and Svoboda, 1985
Majer, V.; Svoboda, V.,
Enthalpies of Vaporization of Organic Compounds: A Critical Review and Data Compilation, Blackwell Scientific Publications, Oxford, 1985, 300. [all data]
Ambrose, Cox, et al., 1960
Ambrose, D.; Cox, J.D.; Townsend, R.,
The critical temperatures of forty organic compounds,
Trans. Faraday Soc., 1960, 56, 1452. [all data]
Chickos, Hosseini, et al., 1995
Chickos, James S.; Hosseini, Sarah; Hesse, Donald G.,
Determination of vaporization enthalpies of simple organic molecules by correlations of changes in gas chromatographic net retention times,
Thermochimica Acta, 1995, 249, 41-62, https://doi.org/10.1016/0040-6031(95)90670-3
. [all data]
Mansson, Sellers, et al., 1977
Mansson, M.; Sellers, P.; Stridh, G.; Sunner, S.,
Enthalpies of vaporization of some 1-substituted n-alkanes,
J. Chem. Thermodyn., 1977, 9, 91. [all data]
Månsson, Sellers, et al., 1977
Månsson, M.; Sellers, P.; Stridh, G.; Sunner, S.,
Enthalpies of vaporization of some 1-substituted n-alkanes,
The Journal of Chemical Thermodynamics, 1977, 9, 1, 91-97, https://doi.org/10.1016/0021-9614(77)90202-6
. [all data]
Reid, 1972
Reid, Robert C.,
Handbook on vapor pressure and heats of vaporization of hydrocarbons and related compounds, R. C. Wilhort and B. J. Zwolinski, Texas A Research Foundation. College Station, Texas(1971). 329 pages.$10.00,
AIChE J., 1972, 18, 6, 1278-1278, https://doi.org/10.1002/aic.690180637
. [all data]
Stephenson and Malanowski, 1987
Stephenson, Richard M.; Malanowski, Stanislaw,
Handbook of the Thermodynamics of Organic Compounds, 1987, https://doi.org/10.1007/978-94-009-3173-2
. [all data]
Forziati, Camin, et al., 1950
Forziati, A.F.; Camin, D.L.; Rossini, F.D.,
Density, refractive index, boiling point, and vapor pressure of eight monoolefin (1-alkene), six pentadiene, and two cyclomonoolefin hydrocarbons,
J. RES. NATL. BUR. STAN., 1950, 45, 5, 406, https://doi.org/10.6028/jres.045.044
. [all data]
Svoboda, Charvátová, et al., 1982
Svoboda, Václav; Charvátová, Vladimíra; Majer, Vladimír; Hynek, Vladimír,
Determination of heats of vaporization and some other thermodynamic properties for four substituted hydrocarbons,
Collect. Czech. Chem. Commun., 1982, 47, 2, 543-549, https://doi.org/10.1135/cccc19820543
. [all data]
Chickos, Hyman, et al., 1981
Chickos, James S.; Hyman, Arthur S.; Ladon, Liina H.; Liebman, Joel F.,
Measurement and estimation of the heats of vaporization of hydrocarbons,
J. Org. Chem., 1981, 46, 21, 4294-4296, https://doi.org/10.1021/jo00334a040
. [all data]
Forziati, Camin, et al., 1950, 2
Forziati, a.F.; Camin, D.L.; Rossini, F.D.,
Density, refractive index, boiling point, and vapor pressure of eight monoolefin (1-alkene), six pentadiene, and two cyclomonoolefin hydrocarbons,
J. Res. NBS, 1950, 45, 406-410. [all data]
Domalski and Hearing, 1996
Domalski, Eugene S.; Hearing, Elizabeth D.,
Heat Capacities and Entropies of Organic Compounds in the Condensed Phase. Volume III,
J. Phys. Chem. Ref. Data, 1996, 25, 1, 1, https://doi.org/10.1063/1.555985
. [all data]
Eliseev, 1986
Eliseev, N.A.,
Thermodynamic calculation of the equilibrium composition of isomeric octenes in dehydrogenation of n-octane,
Izv. Vyssh. Uchebn. Zaved., Khim. Khim. Tekhnol., 1986, 29, 26-29. [all data]
Rang, Martinson, et al., 1974
Rang, S.; Martinson, E.; Muurisepp, M.,
Ionization potentials of unsaturated hydrocarbons. 1. n-Alkenes, Eesti NSV Teaduste Akadeemia Toimetised 23,
Eesti. NSV Tead. Akad. Toim., 1974, 352. [all data]
Demeo and El-Sayed, 1970
Demeo, D.A.; El-Sayed, M.A.,
Ionization potential and structure of olefins,
J. Chem. Phys., 1970, 52, 2622. [all data]
Krause, Taylor, et al., 1978
Krause, D.A.; Taylor, J.W.; Fenske, R.F.,
An analysis of the effects of alkyl substituents on the ionization potentials of n-alkenes,
J. Am. Chem. Soc., 1978, 100, 718. [all data]
Price and Klevens, 1949
Price, W.C.; Klevens, H.B.,
J. Chem. Phys., 1949, 17, 466. [all data]