(CH3O)2CS
- Formula: C3H6O2S
- Molecular weight: 106.144
- IUPAC Standard InChIKey: BJIKOZOULYUROB-UHFFFAOYSA-N
- CAS Registry Number: 1115-13-5
- Chemical structure:
View 3d structure (requires JavaScript / HTML 5) - Other names: O,O-Dimethyl monothiocarbonate; O,O'-Dimethyl thiocarbonate; O,O'-Dimethyl monothiocarbonate

Gas phase ion energetics data

Data compiled as indicated in comments:
LLK - Sharon G. Lias, Rhoda D. Levin, and Sherif A. Kafafi
Ionization energy determinations
IE (eV) | Method | Reference | Comment |
---|---|---|---|
8.7 | PE | Guimon, Gonbeau, et al., 1974 | LLK |
8.99 | PE | Guimon, Gonbeau, et al., 1974 | Vertical value; LLK |

References

Guimon, Gonbeau, et al., 1974
Guimon, C.; Gonbeau, D.; Pfister-Guillouzo, G.; Asbrink, L.; Sandstrom, J.,
Electronic structure of sulphur compounds. VI. Photoelectron spectra of some simple thiocarbonyl compounds,
J. Electron Spectrosc. Relat. Phenom., 1974, 4, 49. [all data]