Oxopropanedinitrile
- Formula: C3N2O
- Molecular weight: 80.0449
- CAS Registry Number: 1115-12-4

Phase change data

Data compiled as indicated in comments:
ALS - Hussein Y. Afeefy, Joel F. Liebman, and Stephen E. Stein
AC - William E. Acree, Jr., James S. Chickos
Quantity | Value | Units | Method | Reference | Comment |
---|---|---|---|---|---|
ΔvapH° | 36.0 ± 3.3 | kJ/mol | V | Glemser and Hausser, 1948 | Reanalyzed by Cox and Pilcher, 1970, Original value = 37.53 kJ/mol; Authors' hf298_condensed=47.5 kcal/mol; ALS |
Enthalpy of vaporization
ΔvapH (kJ/mol) | Temperature (K) | Method | Reference | Comment |
---|---|---|---|---|
37.5 | 276. | A | Stephenson and Malanowski, 1987 | Based on data from 250. to 291. K. See also Glemser and Haüser, 1948.; AC |

Gas phase ion energetics data

Data compiled as indicated in comments:
LLK - Sharon G. Lias, Rhoda D. Levin, and Sherif A. Kafafi
Ionization energy determinations
IE (eV) | Method | Reference | Comment |
---|---|---|---|
12.56 | PE | Thomas and Thompson, 1972 | Vertical value; LLK |

References

Glemser and Hausser, 1948
Glemser, O.; Hausser, V.,
Kohlenoxydverbindungen der nichtmetalle II Eigenschoften von Carbonylcanid,
Z. Naturforsch. B, 1948, 3, 159-163. [all data]
Cox and Pilcher, 1970
Cox, J.D.; Pilcher, G.,
Thermochemistry of Organic and Organometallic Compounds, Academic Press, New York, 1970, 1-636. [all data]
Stephenson and Malanowski, 1987
Stephenson, Richard M.; Malanowski, Stanislaw,
Handbook of the Thermodynamics of Organic Compounds, 1987, https://doi.org/10.1007/978-94-009-3173-2
. [all data]
Glemser and Haüser, 1948
Glemser, O.; Haüser, V.,
Z. Naturforsch. B, 1948, 3B, 159. [all data]
Thomas and Thompson, 1972
Thomas, R.K.; Thompson, H.,
Photoelectron spectra of carbonyl halides and related compounds,
Proc. R. Soc. London A:, 1972, 327, 13. [all data]