Hexamethylenimine
- Formula: C6H13N
- Molecular weight: 99.1741
- IUPAC Standard InChIKey: ZSIQJIWKELUFRJ-UHFFFAOYSA-N
- CAS Registry Number: 111-49-9
- Chemical structure:
View 3d structure (requires JavaScript / HTML 5) - Other names: 1H-Azepine, hexahydro-; Azacycloheptane; Azepine, hexahydro-; Hexahydro-1H-azepine; Hexahydroazepine; Homopiperidine; Perhydroazepine; Hexamethyleneimine; 1-Azacycloheptane; Cyclohexamethylenimine; G 0; UN 2493; Azepan; NSC 16236

Gas phase thermochemistry data

Data compiled by: Hussein Y. Afeefy, Joel F. Liebman, and Stephen E. Stein
Quantity | Value | Units | Method | Reference | Comment |
---|---|---|---|---|---|
ΔfH°gas | -45. ± 2. | kJ/mol | Ccb | An, Zhang, et al., 1981 |

Condensed phase thermochemistry data

Data compiled as indicated in comments:
ALS - Hussein Y. Afeefy, Joel F. Liebman, and Stephen E. Stein
DH - Eugene S. Domalski and Elizabeth D. Hearing
Quantity | Value | Units | Method | Reference | Comment |
---|---|---|---|---|---|
ΔfH°liquid | -89.3 ± 1.6 | kJ/mol | Ccb | An, Zhang, et al., 1981 | ALS |
Quantity | Value | Units | Method | Reference | Comment |
ΔcH°liquid | -4129.7 ± 1.6 | kJ/mol | Ccb | An, Zhang, et al., 1981 | ALS |
Constant pressure heat capacity of liquid
Cp,liquid (J/mol*K) | Temperature (K) | Reference | Comment |
---|---|---|---|
205. | 298. | Conti, Gianni, et al., 1976 | DH |

Phase change data

Data compiled as indicated in comments:
BS - Robert L. Brown and Stephen E. Stein
DRB - Donald R. Burgess, Jr.
AC - William E. Acree, Jr., James S. Chickos
Quantity | Value | Units | Method | Reference | Comment |
---|---|---|---|---|---|
ΔvapH° | 44.3 | kJ/mol | N/A | An, Zhang, et al., 1981 | DRB |
Reduced pressure boiling point
Tboil (K) | Pressure (bar) | Reference | Comment |
---|---|---|---|
411.2 | 0.999 | Weast and Grasselli, 1989 | BS |
Enthalpy of vaporization
ΔvapH (kJ/mol) | Temperature (K) | Method | Reference | Comment |
---|---|---|---|---|
37.7 | 363. | A | Stephenson and Malanowski, 1987 | Based on data from 348. to 423. K.; AC |
40.4 | 327. | A | Stephenson and Malanowski, 1987 | Based on data from 312. to 411. K. See also Dykyj, 1972.; AC |

Henry's Law data

Data compiled by: Rolf Sander
Henry's Law constant (water solution)
kH(T) = k°H exp(d(ln(kH))/d(1/T) ((1/T) - 1/(298.15 K)))
k°H = Henry's law constant for solubility in water at 298.15 K (mol/(kg*bar))
d(ln(kH))/d(1/T) = Temperature dependence constant (K)
k°H (mol/(kg*bar)) | d(ln(kH))/d(1/T) (K) | Method | Reference |
---|---|---|---|
160. | 8200. | M | N/A |

Gas phase ion energetics data

Data evaluated as indicated in comments:
HL - Edward P. Hunter and Sharon G. Lias
Data compiled as indicated in comments:
LLK - Sharon G. Lias, Rhoda D. Levin, and Sherif A. Kafafi
RDSH - Henry M. Rosenstock, Keith Draxl, Bruce W. Steiner, and John T. Herron
Quantity | Value | Units | Method | Reference | Comment |
---|---|---|---|---|---|
Proton affinity (review) | 956.7 | kJ/mol | N/A | Hunter and Lias, 1998 | HL |
Quantity | Value | Units | Method | Reference | Comment |
Gas basicity | 923.5 | kJ/mol | N/A | Hunter and Lias, 1998 | HL |
Ionization energy determinations
IE (eV) | Method | Reference | Comment |
---|---|---|---|
8.5 | EI | Kiser and Gallegos, 1962 | RDSH |
8.41 ± 0.02 | PE | Yoshikawa, Hashimoto, et al., 1974 | Vertical value; LLK |

Normal alkane RI, non-polar column, temperature ramp

View large format table.

Column type Active phase I Reference Comment
CapillaryOV-101864.Zenkevich, 200525. m/0.20 mm/0.10 μm, N2/He, 6. K/min; Tstart: 50. C; Tend: 250. C

Normal alkane RI, non-polar column, custom temperature program

View large format table.

Column type Active phase I Reference Comment
CapillaryMethyl Silicone864.Farkas, Héberger, et al., 2004Program: not specified

Normal alkane RI, polar column, custom temperature program

View large format table.

Column type Active phase I Reference Comment
CapillaryDB-Wax1178.Peng, Yang, et al., 1991Program: not specified

References

An, Zhang, et al., 1981
An, X.-W.; Zhang, Z.-L.; Wang, S.-N.; Yan, J.-Q.; Hu, R.-H.,
Investigation on bond energies: the heat of combustion of hippuric acid, piperazine and azacycloheptane,
Acta Chim. Sin., 1981, 39, 485-492. [all data]
Conti, Gianni, et al., 1976
Conti, G.; Gianni, P.; Matteoli, E.; Mengheri, M.,
Capacita termiche molari di alcuni composti organici mono- e bifunzionali nel liquido puro e in soluzione acquosa a 25C,
Chim. Ind. (Milan), 1976, 58, 225. [all data]
Weast and Grasselli, 1989
CRC Handbook of Data on Organic Compounds, 2nd Editon, Weast,R.C and Grasselli, J.G., ed(s)., CRC Press, Inc., Boca Raton, FL, 1989, 1. [all data]
Stephenson and Malanowski, 1987
Stephenson, Richard M.; Malanowski, Stanislaw,
Handbook of the Thermodynamics of Organic Compounds, 1987, https://doi.org/10.1007/978-94-009-3173-2
. [all data]
Dykyj, 1972
Dykyj, J.,
Petrochemia, 1972, 12, 1, 13. [all data]
Hunter and Lias, 1998
Hunter, E.P.; Lias, S.G.,
Evaluated Gas Phase Basicities and Proton Affinities of Molecules: An Update,
J. Phys. Chem. Ref. Data, 1998, 27, 3, 413-656, https://doi.org/10.1063/1.556018
. [all data]
Kiser and Gallegos, 1962
Kiser, R.W.; Gallegos, E.J.,
A technique for the rapid determination of ionization and appearance potentials,
J. Phys. Chem., 1962, 66, 947. [all data]
Yoshikawa, Hashimoto, et al., 1974
Yoshikawa, K.; Hashimoto, M.; Morishima, I.,
Photoelectron spectroscopic study of cyclic amines. The relation between ionization potentials, basicities, and s character of the nitrogen lone pair electrons,
J. Am. Chem. Soc., 1974, 96, 288. [all data]