Propyl sulfide
- Formula: C6H14S
- Molecular weight: 118.240
- IUPAC Standard InChIKey: ZERULLAPCVRMCO-UHFFFAOYSA-N
- CAS Registry Number: 111-47-7
- Chemical structure:
View 3d structure (requires JavaScript / HTML 5) - Other names: Propane, 1,1'-thiobis-; Dipropyl sulfide; Dipropyl thioether; Propyl monosulfide; 4-Thiaheptane; 1,1'-Thiobispropane; Dipropyl sulphide; (n-C3H7)2S; n-Propyl sulfide; di-n-Propyl sulfide; Di-n-propyl thioether; NSC 78429; Sulfide, n-propyl-

Gas phase thermochemistry data

Data compiled by: Donald R. Burgess, Jr.
Quantity | Value | Units | Method | Reference | Comment |
---|---|---|---|---|---|
ΔfH°gas | -125.2 | kJ/mol | N/A | McCullough, Finke, et al., 1961 | Value computed using ΔfHliquid° value of -169.8±0.88 kj/mol from McCullough, Finke, et al., 1961 and ΔvapH° value of 44.6 kj/mol from missing citation. |

Condensed phase thermochemistry data

Data compiled as indicated in comments:
ALS - Hussein Y. Afeefy, Joel F. Liebman, and Stephen E. Stein
DH - Eugene S. Domalski and Elizabeth D. Hearing
Quantity | Value | Units | Method | Reference | Comment |
---|---|---|---|---|---|
ΔfH°liquid | -169.8 ± 0.88 | kJ/mol | Ccr | McCullough, Finke, et al., 1961 | ALS |
Quantity | Value | Units | Method | Reference | Comment |
ΔcH°liquid | -4794.28 ± 0.75 | kJ/mol | Ccr | McCullough, Finke, et al., 1961 | Reanalyzed by Cox and Pilcher, 1970, Original value = -4793.78 ± 0.75 kJ/mol; ALS |
Quantity | Value | Units | Method | Reference | Comment |
S°liquid | 338.28 | J/mol*K | N/A | McCullough, Finke, et al., 1961 | DH |
Constant pressure heat capacity of liquid
Cp,liquid (J/mol*K) | Temperature (K) | Reference | Comment |
---|---|---|---|
237.90 | 300. | Tutubalina, Gabdrakhmanov, et al., 1982 | T = 273 to 373 K. Cp = 221.21 + 3.060x10-2T + 8.343x10-5T2.; DH |
225.48 | 298.15 | McCullough, Finke, et al., 1961 | T = 11 to 370 K.; DH |

Phase change data

Data compiled as indicated in comments:
BS - Robert L. Brown and Stephen E. Stein
TRC - Thermodynamics Research Center, NIST Boulder Laboratories, Chris Muzny director
AC - William E. Acree, Jr., James S. Chickos
ALS - Hussein Y. Afeefy, Joel F. Liebman, and Stephen E. Stein
DH - Eugene S. Domalski and Elizabeth D. Hearing
Quantity | Value | Units | Method | Reference | Comment |
---|---|---|---|---|---|
Tboil | 415. ± 2. | K | AVG | N/A | Average of 11 values; Individual data points |
Quantity | Value | Units | Method | Reference | Comment |
Ttriple | 170.430 | K | N/A | McCullough, Finke, et al., 1961, 2 | Uncertainty assigned by TRC = 0.05 K; TRC |
Ttriple | 170.44 | K | N/A | McCullough, Finke, et al., 1961, 2 | Uncertainty assigned by TRC = 0.03 K; TRC |
Quantity | Value | Units | Method | Reference | Comment |
ΔvapH° | 44. ± 4. | kJ/mol | AVG | N/A | Average of 6 values; Individual data points |
Enthalpy of vaporization
ΔvapH (kJ/mol) | Temperature (K) | Method | Reference | Comment |
---|---|---|---|---|
42.9 | 328. | N/A | Dykyj, Svoboda, et al., 1999 | Based on data from 313. to 411. K.; AC |
40.6 | 368. | A,EB | Stephenson and Malanowski, 1987 | Based on data from 353. to 427. K. See also White, Barnard--Smith, et al., 1952.; AC |
36.6 | 416. | N/A | Majer and Svoboda, 1985 |
Enthalpy of fusion
ΔfusH (kJ/mol) | Temperature (K) | Reference | Comment |
---|---|---|---|
12.142 | 170.44 | McCullough, Finke, et al., 1961 | DH |
12.13 | 170.4 | Domalski and Hearing, 1996 | AC |
Entropy of fusion
ΔfusS (J/mol*K) | Temperature (K) | Reference | Comment |
---|---|---|---|
71.24 | 170.44 | McCullough, Finke, et al., 1961 | DH |

Reaction thermochemistry data

Data compiled by: Michael M. Meot-Ner (Mautner) and Sharon G. Lias
Individual Reactions
By formula: C6H14S+ + C6H14S = (C6H14S+ • C6H14S)
Bond type: Charge transfer bond (positive ion)
Quantity | Value | Units | Method | Reference | Comment |
---|---|---|---|---|---|
ΔrH° | 119. | kJ/mol | DT | James and Illies, 1996 | gas phase; ΔrH(0K) = 123. kJ/mol |
Quantity | Value | Units | Method | Reference | Comment |
ΔrS° | 168. | J/mol*K | DT | James and Illies, 1996 | gas phase; ΔrH(0K) = 123. kJ/mol |

Henry's Law data

Data compiled by: Rolf Sander
Henry's Law constant (water solution)
kH(T) = k°H exp(d(ln(kH))/d(1/T) ((1/T) - 1/(298.15 K)))
k°H = Henry's law constant for solubility in water at 298.15 K (mol/(kg*bar))
d(ln(kH))/d(1/T) = Temperature dependence constant (K)
k°H (mol/(kg*bar)) | d(ln(kH))/d(1/T) (K) | Method | Reference |
---|---|---|---|
0.33 | 4200. | M | N/A |

Gas phase ion energetics data

Data evaluated as indicated in comments:
HL - Edward P. Hunter and Sharon G. Lias
Data compiled as indicated in comments:
LLK - Sharon G. Lias, Rhoda D. Levin, and Sherif A. Kafafi
RDSH - Henry M. Rosenstock, Keith Draxl, Bruce W. Steiner, and John T. Herron
Quantity | Value | Units | Method | Reference | Comment |
---|---|---|---|---|---|
Proton affinity (review) | 864.7 | kJ/mol | N/A | Hunter and Lias, 1998 | HL |
Quantity | Value | Units | Method | Reference | Comment |
Gas basicity | 834.9 | kJ/mol | N/A | Hunter and Lias, 1998 | HL |
Ionization energy determinations
IE (eV) | Method | Reference | Comment |
---|---|---|---|
8.45 ± 0.05 | EI | Khvostenko and Furlei, 1968 | RDSH |
10.9 | EI | Gowenlock, Kay, et al., 1963 | RDSH |
8.30 ± 0.02 | PI | Watanabe, Nakayama, et al., 1962 | RDSH |
8.34 | PE | Wagner and Bock, 1974 | Vertical value; LLK |
8.34 | PE | Bock, Wagner, et al., 1972 | Vertical value; LLK |
Appearance energy determinations
Ion | AE (eV) | Other Products | Method | Reference | Comment |
---|---|---|---|---|---|
CH3S+ | 12.65 | ? | EI | Gowenlock, Kay, et al., 1963 | RDSH |
C2H5S+ | 12.2 | ? | EI | Gowenlock, Kay, et al., 1963 | RDSH |
C3H7+ | 12.0 | ? | EI | Gowenlock, Kay, et al., 1963 | RDSH |
C3H7S+ | 11.55 | ? | EI | Gowenlock, Kay, et al., 1963 | RDSH |
C3H8S+ | 10.4 | ? | EI | Gowenlock, Kay, et al., 1963 | RDSH |
C5H11S+ | 11.55 | CH3 | EI | Gowenlock, Kay, et al., 1963 | RDSH |

Ion clustering data

Data compiled by: Michael M. Meot-Ner (Mautner) and Sharon G. Lias
Clustering reactions
By formula: C6H14S+ + C6H14S = (C6H14S+ • C6H14S)
Bond type: Charge transfer bond (positive ion)
Quantity | Value | Units | Method | Reference | Comment |
---|---|---|---|---|---|
ΔrH° | 119. | kJ/mol | DT | James and Illies, 1996 | gas phase; ΔrH(0K) = 123. kJ/mol |
Quantity | Value | Units | Method | Reference | Comment |
ΔrS° | 168. | J/mol*K | DT | James and Illies, 1996 | gas phase; ΔrH(0K) = 123. kJ/mol |

Kovats' RI, non-polar column, isothermal

Column type | Active phase | Temperature (C) | I | Reference | Comment |
---|---|---|---|---|---|
Capillary | DB-5 | 100. | 891.2 | Miller and Bruno, 2003 | 30. m/0.25 mm/0.1 μm |
Capillary | DB-5 | 120. | 896.7 | Miller and Bruno, 2003 | 30. m/0.25 mm/0.1 μm |
Capillary | DB-5 | 60. | 884.8 | Miller and Bruno, 2003 | 30. m/0.25 mm/0.1 μm |
Capillary | DB-5 | 80. | 887.4 | Miller and Bruno, 2003 | 30. m/0.25 mm/0.1 μm |
Packed | Apiezon M | 130. | 888. | Garbuzov, Misharina, et al., 1985 | He or N2, Chromosorb W, AW-DMCS; Column length: 2.1 m |
Packed | SE-30 | 110. | 887. | Möckel and Zolg, 1977 | Chromosorb W AW (80-100 mesh); Column length: 2. m |
Packed | Apiezon M | 130. | 888. | Golovnya, Garbuzov, et al., 1976 | N2, Chromosorb W; Column length: 2.1 m |
Packed | Apiezon M | 130. | 888. | Golovnya and Garbuzov, 1974 | N2, Chromosorb W; Column length: 2.1 m |
Capillary | Apiezon L | 120. | 890. | Agr, Tesaric, et al., 1973 | |
Capillary | Squalane | 120. | 882. | Agr, Tesaric, et al., 1973 | |
Capillary | Squalane | 86. | 878. | Agr, Tesaric, et al., 1973 | |
Capillary | Squalane | 120. | 882. | Agrawal, Tesarík, et al., 1972 | N2, Celite 545; Column length: 50. m; Column diameter: 0.3 mm |
Capillary | Squalane | 86. | 878. | Agrawal, Tesarík, et al., 1972 | N2, Celite 545; Column length: 50. m; Column diameter: 0.3 mm |
Capillary | Apiezon L | 120. | 890. | Agrawal, Tesarík, et al., 1972 | N2; Column length: 100. m; Column diameter: 0.3 mm |
Capillary | E-301 | 110. | 877. | Kudryavtseva, Fatalieva, et al., 1972 | |
Packed | DC-200 | 120. | 888. | Golovnya and Arsen'ev, 1970 | Column length: 1.5 m |
Packed | DC-200 | 60. | 879. | Golovnya and Arsen'ev, 1970 | Column length: 1.5 m |
Packed | SE-30 | 130. | 888. | Golovnya and Arsen'ev, 1970 | Column length: 1.5 m |
Packed | SE-30 | 60. | 878. | Golovnya and Arsen'ev, 1970 | Column length: 1.5 m |
Packed | Apiezon L | 130. | 894. | Martinu and Janák, 1970 |

Kovats' RI, polar column, isothermal

Column type | Active phase | Temperature (C) | I | Reference | Comment |
---|---|---|---|---|---|
Capillary | PEG-20M | 80. | 1080.5 | Morishita, Murakita, et al., 1982 | N2; Column length: 50. m; Column diameter: 0.25 mm |
Packed | Carbowax 20M | 110. | 1091. | Möckel and Zolg, 1977 | He, Chromosorb W AW (80-100 mesh); Column length: 6. m |
Packed | Polyethylene Glycol | 130. | 1101. | Golovnya, Garbuzov, et al., 1976 | N2, Chromosorb W; Column length: 2.1 m |

Van Den Dool and Kratz RI, polar column, temperature ramp

Column type | Active phase | I | Reference | Comment |
---|---|---|---|---|
Capillary | HP-Innowax | 1093. | Storsberg, Schulz, et al., 2004 | 60. m/0.25 mm/0.5 μm, H2, 10. K/min; Tstart: 35. C; Tend: 220. C |

Normal alkane RI, non-polar column, isothermal

Column type | Active phase | Temperature (C) | I | Reference | Comment |
---|---|---|---|---|---|
Capillary | Polydimethyl siloxane with 5 % Ph groups | 100. | 891. | Safa and Hadjmohannadi, 2005 | 30. m/0.25 mm/0.10 μm, Nitrogen |
Capillary | Polydimethyl siloxane with 5 % Ph groups | 120. | 897. | Safa and Hadjmohannadi, 2005 | 30. m/0.25 mm/0.10 μm, Nitrogen |
Capillary | Polydimethyl siloxane with 5 % Ph groups | 60. | 885. | Safa and Hadjmohannadi, 2005 | 30. m/0.25 mm/0.10 μm, Nitrogen |
Capillary | Polydimethyl siloxane with 5 % Ph groups | 80. | 887. | Safa and Hadjmohannadi, 2005 | 30. m/0.25 mm/0.10 μm, Nitrogen |

Normal alkane RI, non-polar column, temperature ramp

Column type | Active phase | I | Reference | Comment |
---|---|---|---|---|
Capillary | HP-5 | 894. | Kubec, Drhová, et al., 1999 | 30. m/0.25 mm/0.25 μm, N2, 40. C @ 3. min, 4. K/min, 240. C @ 10. min |
Capillary | DB-1 | 872. | Yu, Wu, et al., 1994 | 60. m/0.25 mm/1.0 μm, He, 40. C @ 5. min, 2. K/min, 260. C @ 60. min |

Normal alkane RI, non-polar column, custom temperature program

Column type | Active phase | I | Reference | Comment |
---|---|---|---|---|
Capillary | Methyl Silicone | 883. | Zenkevich, 1999 | Program: not specified |
Capillary | Polydimethyl siloxanes | 878. | Zenkevich, 1998 | Program: not specified |
Capillary | SE-52 | 877. | van Langenhove and Schamp, 1986 | Column length: 100. m; Column diameter: 0.50 mm; Program: not specified |
Capillary | OV-1, SE-30, Methyl silicone, SP-2100, OV-101, DB-1, etc. | 890. | Waggott and Davies, 1984 | Hydrogen; Column length: 50. m; Column diameter: 0.32 mm; Program: not specified |

Normal alkane RI, polar column, temperature ramp

Column type | Active phase | I | Reference | Comment |
---|---|---|---|---|
Capillary | HP-Innowax | 1069. | Kubec, Drhová, et al., 1999 | 30. m/0.25 mm/0.25 μm, He, 40. C @ 3. min, 4. K/min, 190. C @ 10. min |

References

McCullough, Finke, et al., 1961
McCullough, J.P.; Finke, H.L.; Hubbard, W.N.; Todd, S.S.; Messerly, J.F.; Douslin, D.R.; Waddington, G.,
Thermodynamic properties of four linear thiaalkanes,
J. Phys. Chem., 1961, 65, 784-791. [all data]
Cox and Pilcher, 1970
Cox, J.D.; Pilcher, G.,
Thermochemistry of Organic and Organometallic Compounds, Academic Press, New York, 1970, 1-636. [all data]
Tutubalina, Gabdrakhmanov, et al., 1982
Tutubalina, V.P.; Gabdrakhmanov, F.G.; Konyukhova, T.M.,
Study of the heat capacity of n-sulfides, 1982, Teplo-Massoobmen Khim. [all data]
McCullough, Finke, et al., 1961, 2
McCullough, J.P.; Finke, H.L.; Hubbard, W.N.; Todd, S.S.; Messerly, J.F.; Douslin, D.R.; Waddington, G.,
Thermodynamic Properties of Four Linear Thiaalkanes,
J. Phys. Chem., 1961, 65, 784-91. [all data]
Dykyj, Svoboda, et al., 1999
Dykyj, J.; Svoboda, J.; Wilhoit, R.C.; Frenkel, M.L.; Hall, K.R.,
Vapor Pressure of Chemicals: Part A. Vapor Pressure and Antoine Constants for Hydrocarbons and Sulfur, Selenium, Tellurium and Hydrogen Containing Organic Compounds, Springer, Berlin, 1999, 373. [all data]
Stephenson and Malanowski, 1987
Stephenson, Richard M.; Malanowski, Stanislaw,
Handbook of the Thermodynamics of Organic Compounds, 1987, https://doi.org/10.1007/978-94-009-3173-2
. [all data]
White, Barnard--Smith, et al., 1952
White, P.T.; Barnard--Smith, D.G.; Fidler, F.A.,
Vapor Pressure--Temperature Relationships of Sulfur Compounds Related to Petroleum,
Ind. Eng. Chem., 1952, 44, 6, 1430-1438, https://doi.org/10.1021/ie50510a064
. [all data]
Majer and Svoboda, 1985
Majer, V.; Svoboda, V.,
Enthalpies of Vaporization of Organic Compounds: A Critical Review and Data Compilation, Blackwell Scientific Publications, Oxford, 1985, 300. [all data]
Domalski and Hearing, 1996
Domalski, Eugene S.; Hearing, Elizabeth D.,
Heat Capacities and Entropies of Organic Compounds in the Condensed Phase. Volume III,
J. Phys. Chem. Ref. Data, 1996, 25, 1, 1, https://doi.org/10.1063/1.555985
. [all data]
James and Illies, 1996
James, M.A.; Illies, A.J.,
Studies of two-center three-electron S...S bonds in [n-Pr2S...Sn-Pr2]+ and [i-Pr2S...Si-Pr2]+: Thermochemistry of adduct formation and MS/MS metastable and collision-induced dissociation spectra of the adducts,
J. Phys. Chem., 1996, 100, 39, 15794, https://doi.org/10.1021/jp9612487
. [all data]
Hunter and Lias, 1998
Hunter, E.P.; Lias, S.G.,
Evaluated Gas Phase Basicities and Proton Affinities of Molecules: An Update,
J. Phys. Chem. Ref. Data, 1998, 27, 3, 413-656, https://doi.org/10.1063/1.556018
. [all data]
Khvostenko and Furlei, 1968
Khvostenko, V.I.; Furlei, I.I.,
Ionisation potentials of sulphides,
Zh. Fiz. Khim., 1968, 42, 13, In original 5. [all data]
Gowenlock, Kay, et al., 1963
Gowenlock, B.G.; Kay, J.; Majer, J.R.,
Electron impact studies of some sulphides and disulphides,
J. Chem. Soc. Faraday Trans., 1963, 59, 2463. [all data]
Watanabe, Nakayama, et al., 1962
Watanabe, K.; Nakayama, T.; Mottl, J.,
Ionization potentials of some molecules,
J. Quant. Spectry. Radiative Transfer, 1962, 2, 369. [all data]
Wagner and Bock, 1974
Wagner, G.; Bock, H.,
Photoelektronenspektren und molekuleigenschaften, XXVI. Die delokalisation von schwefel-elektronenpaaren in alkylsulfiden und -disulfiden,
Chem. Ber., 1974, 107, 68. [all data]
Bock, Wagner, et al., 1972
Bock, H.; Wagner, G.; Kroner, J.,
Photoelektronenspektren und molekuleigenschaften, XIV. Die delokalisation des schwefel-elektronenpaar in CH3S-substituierten aromaten,
Chem. Ber., 1972, 105, 3850. [all data]
Kharlamova, et al., 1973
Kharlamova, E.N., et al.,
J. Structural Chem. S.S.S.R., 1973, 70. [all data]
Miller and Bruno, 2003
Miller, K.E.; Bruno, T.J.,
Isothermal Kováts retention indices of sulfur compounds on a poly(5% diphenyl-95% dimethylsiloxane) stationary phase,
J. Chromatogr. A, 2003, 1007, 1-2, 117-125, https://doi.org/10.1016/S0021-9673(03)00958-0
. [all data]
Garbuzov, Misharina, et al., 1985
Garbuzov, V.G.; Misharina, T.A.; Aerov, A.F.; Golovnya, R.V.,
Gas chromatographic retention indices for sulphur(II)-containing organic substances,
J. Anal. Chem. USSR (Engl. Transl.), 1985, 40, 4, 576-586. [all data]
Möckel and Zolg, 1977
Möckel, H.J.; Zolg, M.,
Retentionsindices n-aliphatischer Schwefelverbindungen,
Z. Anal. Chem., 1977, 285, 1, 45-46, https://doi.org/10.1007/BF00446017
. [all data]
Golovnya, Garbuzov, et al., 1976
Golovnya, R.V.; Garbuzov, V.G.; Misharina, T.A.,
Gas chromatographic characteristics of sulfur compounds. 2. Normal sulfides,
Izv. Akad. Nauk Kaz. SSR Ser. Khim., 1976, 10, 2266-2270. [all data]
Golovnya and Garbuzov, 1974
Golovnya, R.V.; Garbuzov, V.G.,
Effect of heteroatom in aliphatic sulfur- and oxygen-containing compounds on the values of the retention indices in gas chromatography,
Izv. Akad. Nauk SSSR Ser. Khim., 1974, 7, 1519-1521. [all data]
Agr, Tesaric, et al., 1973
Agr, X.X.; Tesaric, K.; Janak, J.,
Will be entered later,
J. Chromatogr., 1973, 95, 207-215. [all data]
Agrawal, Tesarík, et al., 1972
Agrawal, B.B.; Tesarík, K.; Janák, J.,
Gas chromatographic characterization of sulphur compounds in the 93-162° gasoline cut from Romashkino crude oil using Kováts retention indices,
J. Chromatogr., 1972, 65, 1, 207-215, https://doi.org/10.1016/S0021-9673(00)86933-2
. [all data]
Kudryavtseva, Fatalieva, et al., 1972
Kudryavtseva, N.A.; Fatalieva, A.A.; Lulova, N.I.; Vinogradova, I.E.,
Methods of assessing fuel and oil quality. Use of gas chromatography to identify components of decomposition products from Sul'fol antiscuff additive,
Chem. Technol. Fuels Oils (Engl. Transl.), 1972, 8, 10, 786-790, https://doi.org/10.1007/BF00717079
. [all data]
Golovnya and Arsen'ev, 1970
Golovnya, R.V.; Arsen'ev, Y.N.,
Gas-chromatographic method for the analysis of n-mercaptans and symmetrical n-sulfides and n-disulfides,
Bull. Acad. Sci. USSR, Div. Chem. Sci. (Engl. Transl.), 1970, 6, 4, 1316-1318, https://doi.org/10.1007/BF00852683
. [all data]
Martinu and Janák, 1970
Martinu, V.; Janák, J.,
Gas-liquid chromatographic retention data of some aliphatic and alicyclic sulphides,
J. Chromatogr., 1970, 52, 69-75, https://doi.org/10.1016/S0021-9673(01)96545-8
. [all data]
Morishita, Murakita, et al., 1982
Morishita, F.; Murakita, H.; Takemura, Y.; Kojima, T.,
Prediction of molecular structures of thiols and sulphides by retention indices,
J. Chromatogr., 1982, 239, 483-492, https://doi.org/10.1016/S0021-9673(00)82005-1
. [all data]
Storsberg, Schulz, et al., 2004
Storsberg, J.; Schulz, H.; Keusgen, M.; Tannous, F.; Dehmer, K.J.; Joachim Keller, E.R.,
Chemical characterization of interspecific hybrids between Allium cepa L. and Allium kermesinum Rchb.,
J. Agric. Food Chem., 2004, 52, 17, 5499-5505, https://doi.org/10.1021/jf049684a
. [all data]
Safa and Hadjmohannadi, 2005
Safa, F.; Hadjmohannadi, M.R.,
Use of topological indices of organic sulfur compounds in quantitative structure-retention relationship study,
QSAR Comb. Sci., 2005, 24, 9, 1026-1032, https://doi.org/10.1002/qsar.200530008
. [all data]
Kubec, Drhová, et al., 1999
Kubec, R.; Drhová, V.; Velísek, J.,
Volatile compounds thermally generated from S-propylcysteine and S-propylcysteine sulfoxide - aroma precursors of Allium vegetables,
J. Agric. Food Chem., 1999, 47, 3, 1132-1138, https://doi.org/10.1021/jf980974z
. [all data]
Yu, Wu, et al., 1994
Yu, T.-H.; Wu, C.-M.; Ho, C.-T.,
Meat-like flavor generated from thermal interactions of glucose and alliin or deoxyalliin,
J. Agric. Food Chem., 1994, 42, 4, 1005-1009, https://doi.org/10.1021/jf00040a032
. [all data]
Zenkevich, 1999
Zenkevich, I.G.,
Dependence of Gas Chromatographic Retention Indices on Dynamics Molecular Characteristics,
Zh. Fiz. Khim., 1999, 73, 5, 905-910. [all data]
Zenkevich, 1998
Zenkevich, I.G.,
The Principle of Structural Analogy in the Calculation of Gas Chromatographic Retention Indices using Physico-Chemical Constants of Organic Compounds,
Zh. Anal. Khim. (Rus.), 1998, 53, 1, 43-49. [all data]
van Langenhove and Schamp, 1986
van Langenhove, H.; Schamp, N.,
Identification of Volatiles in the Head Space of Acid-Treated Phosphate Rock by Gas Chromatography-Mass Spectromety,
J. Chromatogr., 1986, 351, 65-75, https://doi.org/10.1016/S0021-9673(01)83473-7
. [all data]
Waggott and Davies, 1984
Waggott, A.; Davies, I.W.,
Identification of organic pollutants using linear temperature programmed retention indices (LTPRIs) - Part II, 1984, retrieved from http://dwi.defra.gov.uk/research/completed-research/reports/dwi0383.pdf. [all data]