Butane, 1-isocyanato-
- Formula: C5H9NO
- Molecular weight: 99.1311
- IUPAC Standard InChIKey: HNHVTXYLRVGMHD-UHFFFAOYSA-N
- CAS Registry Number: 111-36-4
- Chemical structure:
View 3d structure (requires JavaScript / HTML 5) - Other names: Isocyanic acid, butyl ester; n-Butyl isocyanate; Butyl isocyanate; 1-Isocyanatobutane; n-C4H9NCO; 1-Butyl isocyanate; Isocyanic acid n-butyl ester; BIC; UN 2485

Phase change data

Data compiled as indicated in comments:
TRC - Thermodynamics Research Center, NIST Boulder Laboratories, Chris Muzny director
AC - William E. Acree, Jr., James S. Chickos
Quantity | Value | Units | Method | Reference | Comment |
---|---|---|---|---|---|
Tboil | 388. | K | N/A | Gross and Gloede, 1963 | Uncertainty assigned by TRC = 4. K; TRC |
Enthalpy of vaporization
ΔvapH (kJ/mol) | Temperature (K) | Method | Reference | Comment |
---|---|---|---|---|
38.5 | 308. | N/A | Ahmad, Giesen, et al., 2004 | Based on data from 293. to 388. K.; AC |
46.8 | 288. | A | Stephenson and Malanowski, 1987 | Based on data from 273. to 389. K. See also Zhuravlev, Moncharzh, et al., 1974.; AC |

Gas phase ion energetics data

Data compiled by: Sharon G. Lias, Rhoda D. Levin, and Sherif A. Kafafi
Ionization energy determinations
IE (eV) | Method | Reference | Comment |
---|---|---|---|
10.14 ± 0.05 | PE | Neijzen and DeLange, 1980 | Vertical value |

References

Gross and Gloede, 1963
Gross, H.; Gloede, J.,
Chem. Ber., 1963, 96, 1387-94. [all data]
Ahmad, Giesen, et al., 2004
Ahmad, Suhel; Giesen, Ralf; Lucas, Klaus,
Vapor-Liquid Equilibrium Studies for Systems Containing n -Butylisocyanate at Temperatures between 323.15 K and 371.15 K,
J. Chem. Eng. Data, 2004, 49, 4, 826-831, https://doi.org/10.1021/je030222n
. [all data]
Stephenson and Malanowski, 1987
Stephenson, Richard M.; Malanowski, Stanislaw,
Handbook of the Thermodynamics of Organic Compounds, 1987, https://doi.org/10.1007/978-94-009-3173-2
. [all data]
Zhuravlev, Moncharzh, et al., 1974
Zhuravlev, E.Z.; Moncharzh, N.M.; Vodop'yanov, V.G.,
Tr. Khim. Khim. Tecknol., 1974, 4, 102. [all data]
Neijzen and DeLange, 1980
Neijzen, B.J.M.; DeLange, C.A.,
Photoelectron spectroscopy of some thiocyanates, isocyanates and isothiocyanates,
J. Electron Spectrosc. Relat. Phenom., 1980, 18, 179. [all data]