1-Hexanamine
- Formula: C6H15N
- Molecular weight: 101.1900
- IUPAC Standard InChIKey: BMVXCPBXGZKUPN-UHFFFAOYSA-N
- CAS Registry Number: 111-26-2
- Chemical structure:
View 3d structure (requires JavaScript / HTML 5) - Other names: Hexylamine; n-Hexylamine; Mono-n-hexylamine; 1-Aminohexane; 1-Hexylamine; n-C6H13NH2

Gas phase thermochemistry data

Data compiled by: Donald R. Burgess, Jr.
Quantity | Value | Units | Method | Reference | Comment |
---|---|---|---|---|---|
ΔfH°gas | -193.9 | kJ/mol | N/A | Lemoult, 1907 | Value computed using ΔfHliquid° value of -239 kj/mol from Lemoult, 1907 and ΔvapH° value of 45.1±0.06 kj/mol from missing citation. |

Condensed phase thermochemistry data

Data compiled as indicated in comments:
ALS - Hussein Y. Afeefy, Joel F. Liebman, and Stephen E. Stein
DH - Eugene S. Domalski and Elizabeth D. Hearing
Quantity | Value | Units | Method | Reference | Comment |
---|---|---|---|---|---|
ΔfH°liquid | -239. | kJ/mol | Ccb | Lemoult, 1907 | ALS |
Quantity | Value | Units | Method | Reference | Comment |
ΔcH°liquid | -4292.8 | kJ/mol | Ccb | Lemoult, 1907 | ALS |
Constant pressure heat capacity of liquid
Cp,liquid (J/mol*K) | Temperature (K) | Reference | Comment |
---|---|---|---|
252. | 298.15 | Konicek and Wadso, 1971 | DH |

Phase change data

Data compiled as indicated in comments:
BS - Robert L. Brown and Stephen E. Stein
TRC - Thermodynamics Research Center, NIST Boulder Laboratories, Chris Muzny director
AC - William E. Acree, Jr., James S. Chickos
ALS - Hussein Y. Afeefy, Joel F. Liebman, and Stephen E. Stein
Quantity | Value | Units | Method | Reference | Comment |
---|---|---|---|---|---|
Tboil | 403. ± 4. | K | AVG | N/A | Average of 10 values; Individual data points |
Quantity | Value | Units | Method | Reference | Comment |
Tfus | 251.9 | K | N/A | Anonymous, 1955 | Uncertainty assigned by TRC = 0.6 K; TRC |
Tfus | 254.15 | K | N/A | Anonymous, 1948 | Uncertainty assigned by TRC = 2. K; TRC |
Tfus | 260.15 | K | N/A | Anonymous, 1948 | Uncertainty assigned by TRC = 4. K; TRC |
Tfus | 254.15 | K | N/A | Jaeger, 1917 | Uncertainty assigned by TRC = 1. K; TRC |
Quantity | Value | Units | Method | Reference | Comment |
ΔvapH° | 45.13 | kJ/mol | N/A | Majer and Svoboda, 1985 | |
ΔvapH° | 45.0 | kJ/mol | CGC | Chickos, Hosseini, et al., 1995 | Based on data from 323. to 373. K.; AC |
ΔvapH° | 45.1 ± 0.1 | kJ/mol | C | Wadsö, Heikkilä, et al., 1969 | AC |
ΔvapH° | 45.10 ± 0.06 | kJ/mol | C | Wadso, 1969 | ALS |
Enthalpy of vaporization
ΔvapH (kJ/mol) | Temperature (K) | Method | Reference | Comment |
---|---|---|---|---|
36.54 | 405.9 | N/A | Majer and Svoboda, 1985 | |
42.2 | 318. | A | Stephenson and Malanowski, 1987 | Based on data from 303. to 406. K.; AC |

Henry's Law data

Data compiled by: Rolf Sander
Henry's Law constant (water solution)
kH(T) = k°H exp(d(ln(kH))/d(1/T) ((1/T) - 1/(298.15 K)))
k°H = Henry's law constant for solubility in water at 298.15 K (mol/(kg*bar))
d(ln(kH))/d(1/T) = Temperature dependence constant (K)
k°H (mol/(kg*bar)) | d(ln(kH))/d(1/T) (K) | Method | Reference |
---|---|---|---|
37. | M | N/A |

Gas phase ion energetics data

Data evaluated as indicated in comments:
HL - Edward P. Hunter and Sharon G. Lias
L - Sharon G. Lias
Data compiled as indicated in comments:
MM - Michael M. Meot-Ner (Mautner)
LLK - Sharon G. Lias, Rhoda D. Levin, and Sherif A. Kafafi
Quantity | Value | Units | Method | Reference | Comment |
---|---|---|---|---|---|
IE (evaluated) | 8.6 | eV | N/A | N/A | L |
Quantity | Value | Units | Method | Reference | Comment |
Proton affinity (review) | 927.5 | kJ/mol | N/A | Hunter and Lias, 1998 | HL |
Quantity | Value | Units | Method | Reference | Comment |
Gas basicity | 893.5 | kJ/mol | N/A | Hunter and Lias, 1998 | HL |
Proton affinity at 298K
Proton affinity (kJ/mol) | Reference | Comment |
---|---|---|
927.6 | Wang, Chu, et al., 1999 | KM results obtained from CID of complexes with other primary amines at E(cm) = 0 eV, extrapolated from CID at E(cm) = 0.8, 1.5, 2.0 eV; MM |
927.6 | Wang, Chu, et al., 1999 | KM results obtained from CID of complexes with other primary amines using Fenselau/Wesdemiotis correction; MM |
Ionization energy determinations
IE (eV) | Method | Reference | Comment |
---|---|---|---|
8.6 | PE | Aue and Bowers, 1979 | LLK |
8.63 ± 0.05 | PI | Iskakov and Potapov, 1971 | LLK |

Kovats' RI, non-polar column, isothermal

Data compiled by: NIST Mass Spectrometry Data Center, William E. Wallace, director

Column type PackedCapillaryCapillaryPackedPacked
Active phase C78, Branched paraffinOV-101OV-101C78, Branched paraffinApolane
Column length (m) 3.320.20.3.33.7
Carrier gas He
Substrate    Chromosorb G HP
Column diameter (mm)  0.50.5
Phase thickness (μm)
Temperature (C) 130.150.180.130.130.
I 813.4835.3834.4813.4816.
ReferenceDallos, Sisak, et al., 2000Cha and Lee, 1994Cha and Lee, 1994Reddy, Dutoit, et al., 1992Dutoit, 1991
Comment MSDC-RI MSDC-RI MSDC-RI MSDC-RI MSDC-RI
Column type PackedPackedPackedPackedPacked
Active phase SE-30SE-30SE-30Apiezon LApiezon L
Column length (m) 1.3.3. 2.26
Carrier gas HeN2N2
Substrate Chromaton N Super (75-100 mesh)Chromosorb A AWChromosorb W AW Teflon-Haloport
Column diameter (mm)
Phase thickness (μm)
Temperature (C) 170.180.180.100.130.
I 829.848.848.839.827.
ReferenceVoelkel, 1987Oszczapowicz, Osek, et al., 1985Oszczapowicz, Osek, et al., 1984Golovnya and Zhuravleva, 1973Landault and Guiochon, 1964
Comment MSDC-RI MSDC-RI MSDC-RI MSDC-RI MSDC-RI

References

Lemoult, 1907
Lemoult, M.P.,
Recherches theoriques et experimentales sur les chaleurs de combustion et de formation des composes organiques,
Ann. Chim. Phys., 1907, 12, 395-432. [all data]
Konicek and Wadso, 1971
Konicek, J.; Wadso, I.,
Thermochemical properties of some carboxylic acids, amines and N-substituted amides in aqueous solution,
Acta Chem. Scand., 1971, 25, 1541-1551. [all data]
Anonymous, 1955
Anonymous, R.,
, Am. Pet. Inst. Res. Proj. 45, Tech. Rep. 14, No. 1, Ohio State Univ., 1955. [all data]
Anonymous, 1948
Anonymous, B.,
The Chemistry of Fatty Amines, Armour & Co., Chicago, 1948. [all data]
Jaeger, 1917
Jaeger, F.M.,
Z. Anorg. Allg. Chem., 1917, 101, 130. [all data]
Majer and Svoboda, 1985
Majer, V.; Svoboda, V.,
Enthalpies of Vaporization of Organic Compounds: A Critical Review and Data Compilation, Blackwell Scientific Publications, Oxford, 1985, 300. [all data]
Chickos, Hosseini, et al., 1995
Chickos, James S.; Hosseini, Sarah; Hesse, Donald G.,
Determination of vaporization enthalpies of simple organic molecules by correlations of changes in gas chromatographic net retention times,
Thermochimica Acta, 1995, 249, 41-62, https://doi.org/10.1016/0040-6031(95)90670-3
. [all data]
Wadsö, Heikkilä, et al., 1969
Wadsö, Ingemar; Heikkilä, Jussi; Beagley, B.; Aalto, Tarja; Werner, Per-Erik; Junggren, Ulf; Lamm, Bo; Samuelsson, Benny,
Enthalpies of Vaporization of Organic Compounds. III. Amines.,
Acta Chem. Scand., 1969, 23, 2061-2064, https://doi.org/10.3891/acta.chem.scand.23-2061
. [all data]
Wadso, 1969
Wadso, I.,
Enthalpies of vaporization of organic compounds,
Acta Chem. Scand., 1969, 23, 2061. [all data]
Stephenson and Malanowski, 1987
Stephenson, Richard M.; Malanowski, Stanislaw,
Handbook of the Thermodynamics of Organic Compounds, 1987, https://doi.org/10.1007/978-94-009-3173-2
. [all data]
Hunter and Lias, 1998
Hunter, E.P.; Lias, S.G.,
Evaluated Gas Phase Basicities and Proton Affinities of Molecules: An Update,
J. Phys. Chem. Ref. Data, 1998, 27, 3, 413-656, https://doi.org/10.1063/1.556018
. [all data]
Wang, Chu, et al., 1999
Wang, Z.; Chu, I.K.; Rodriquez, C.F.; Hopkinson, A.C.; Siu, K.W.M.,
α,ω-Diaminoalkanes as models for bases that dicoordinate the proton: An evaluation of the kinetic method for estimating their proton affinities,
J. Phys. Chem. A., 1999, 103, 8700. [all data]
Aue and Bowers, 1979
Aue, D.H.; Bowers, M.T.,
Chapter 9. Stabilities of positive ions from equilibrium gas phase basicity measurements
in Ions Chemistry,, ed. M.T. Bowers, 1979. [all data]
Iskakov and Potapov, 1971
Iskakov, L.I.; Potapov, V.K.,
Dissociative photoionization of n-alkylamines,
Khim. Vys. Energ., 1971, 5, 534. [all data]