Hexane, 1-bromo-
- Formula: C6H13Br
- Molecular weight: 165.071
- IUPAC Standard InChIKey: MNDIARAMWBIKFW-UHFFFAOYSA-N
- CAS Registry Number: 111-25-1
- Chemical structure:
View 3d structure (requires JavaScript / HTML 5) - Other names: n-Hexyl bromide; Hexyl bromide; 1-Bromohexane; 1-Hexyl bromide; Bromohexane

Gas phase thermochemistry data

Data compiled by: Hussein Y. Afeefy, Joel F. Liebman, and Stephen E. Stein
Quantity | Value | Units | Method | Reference | Comment |
---|---|---|---|---|---|
ΔfH°gas | -150.1 ± 2.1 | kJ/mol | Ccr | Bjellerup, 1961 |

Condensed phase thermochemistry data

Data compiled as indicated in comments:
ALS - Hussein Y. Afeefy, Joel F. Liebman, and Stephen E. Stein
DH - Eugene S. Domalski and Elizabeth D. Hearing
Quantity | Value | Units | Method | Reference | Comment |
---|---|---|---|---|---|
ΔfH°liquid | -194.5 ± 1.6 | kJ/mol | Ccr | Bjellerup, 1961 | ALS |
Quantity | Value | Units | Method | Reference | Comment |
ΔcH°liquid | -4024.6 ± 1.6 | kJ/mol | Ccr | Bjellerup, 1961 | ALS |
Quantity | Value | Units | Method | Reference | Comment |
S°liquid | 452.92 | J/mol*K | N/A | Deese, 1931 | Extrapolation below 100 K, 58.12 J/mol*K.; DH |
Constant pressure heat capacity of liquid
Cp,liquid (J/mol*K) | Temperature (K) | Reference | Comment |
---|---|---|---|
219.7 | 298.15 | Shehatta, 1993 | DH |
203.55 | 298.8 | Deese, 1931 | T = 95 to 290 K. Value is unsmoothed experimental datum.; DH |

Phase change data

Data compiled as indicated in comments:
BS - Robert L. Brown and Stephen E. Stein
TRC - Thermodynamics Research Center, NIST Boulder Laboratories, Chris Muzny director
AC - William E. Acree, Jr., James S. Chickos
ALS - Hussein Y. Afeefy, Joel F. Liebman, and Stephen E. Stein
DH - Eugene S. Domalski and Elizabeth D. Hearing
CAL - James S. Chickos, William E. Acree, Jr., Joel F. Liebman, Students of Chem 202 (Introduction to the Literature of Chemistry), University of Missouri -- St. Louis
Quantity | Value | Units | Method | Reference | Comment |
---|---|---|---|---|---|
Tboil | 427. to 431. | K | N/A | Farchan Laboratories, 1990 | BS |
Tboil | 428.5 | K | N/A | Weast and Grasselli, 1989 | BS |
Tboil | 428. | K | N/A | American Tokyo Kasei, 1988 | BS |
Tboil | 430. | K | N/A | Lecat, 1943 | Uncertainty assigned by TRC = 0.25 K; TRC |
Quantity | Value | Units | Method | Reference | Comment |
Tfus | 188.45 | K | N/A | Timmermans, 1952 | Uncertainty assigned by TRC = 0.6 K; TRC |
Tfus | 188.1 | K | N/A | Deese, 1931, 2 | Uncertainty assigned by TRC = 0.2 K; TRC |
Quantity | Value | Units | Method | Reference | Comment |
ΔvapH° | 45.8 ± 0.5 | kJ/mol | AVG | N/A | Average of 6 values; Individual data points |
Enthalpy of vaporization
ΔvapH (kJ/mol) | Temperature (K) | Method | Reference | Comment |
---|---|---|---|---|
43.2 | 348. | A,EST | Stephenson and Malanowski, 1987 | Based on data from 333. to 456. K. See also Li and Rossini, 1961 and Dykyj, 1972.; AC |
Enthalpy of fusion
ΔfusH (kJ/mol) | Temperature (K) | Reference | Comment |
---|---|---|---|
18.05 | 188.1 | Domalski and Hearing, 1996 | AC |
18.054 | 188.1 | Deese, 1931 | DH |
Entropy of fusion
ΔfusS (J/mol*K) | Temperature (K) | Reference | Comment |
---|---|---|---|
95.98 | 188.1 | Domalski and Hearing, 1996 | CAL |
95.98 | 188.1 | Deese, 1931 | DH |

Gas phase ion energetics data

Data compiled by: Sharon G. Lias and Joel F. Liebman
Ionization energy determinations
IE (eV) | Method | Reference |
---|---|---|
9.91 | EST | Luo and Pacey, 1992 |
10.06 ± 0.05 | EI | Holmes and Lossing, 1991 |

Kovats' RI, non-polar column, isothermal

Column type | Active phase | Temperature (C) | I | Reference | Comment |
---|---|---|---|---|---|
Capillary | HP-1 | 20. | 920.6 | Koutek, Cvacka, et al., 2001 | 6. m/0.310 mm/0.52 μm, He |
Capillary | HP-1 | 20. | 921.4 | Koutek, Cvacka, et al., 2001 | 6. m/0.310 mm/0.52 μm, He |
Packed | Apolane | 130. | 935. | Dutoit, 1991 | Column length: 3.7 m |
Packed | Apiezon L | 75. | 982. | Castello and D'Amato, 1985 | He, Chromosorb W AW DMCS; Column length: 3. m |
Packed | Apolane | 70. | 918.3 | Riedo, Fritz, et al., 1976 | He, Chromosorb; Column length: 2.4 m |
Capillary | Squalane | 115. | 918. | Lafosse and Thuaud-Chourrout, 1975 | Column length: 100. m; Column diameter: 0.25 mm |
Packed | Apiezon L | 100. | 942. | Brown, Chapman, et al., 1968 | N2, DCMS-treated Chromosorb W; Column length: 2.3 m |
Packed | Apiezon L | 150. | 960. | Brown, Chapman, et al., 1968 | N2, DCMS-treated Chromosorb W; Column length: 2.3 m |
Packed | SE-30 | 175. | 948. | Casteignau and Villessot, 1968 | Column length: 3. m |
Packed | Apiezon L | 130. | 951. | von Kováts, 1958 | Celite (40:60 Gewichtsverhaltnis) |
Packed | Apiezon L | 190. | 964. | von Kováts, 1958 | Celite (40:60 Gewichtsverhaltnis) |

Kovats' RI, polar column, isothermal

Column type | Active phase | Temperature (C) | I | Reference | Comment |
---|---|---|---|---|---|
Packed | Carbowax 20M | 100. | 1167. | Castello and D'Amato, 1985 | He, Chromosorb W AW DMCS; Column length: 3. m |
Packed | Carbowax 20M | 125. | 1159. | Castello and D'Amato, 1985 | He, Chromosorb W AW DMCS; Column length: 3. m |
Packed | Carbowax 20M | 75. | 1147. | Castello and D'Amato, 1985 | He, Chromosorb W AW DMCS; Column length: 3. m |
Packed | Carbowax 20M | 175. | 1187. | Casteignau and Villessot, 1968 | Column length: 3. m |

Van Den Dool and Kratz RI, non-polar column, temperature ramp

Column type | Active phase | I | Reference | Comment |
---|---|---|---|---|
Capillary | SE-54 | 940. | Weber, 1986 | 25. m/0.31 mm/0.17 μm, H2, 2. K/min; Tstart: 35. C |

Van Den Dool and Kratz RI, non-polar column, custom temperature program

Column type | Active phase | I | Reference | Comment |
---|---|---|---|---|
Capillary | DB-1 | 927. | Peng, 2000 | 15. m/0.53 mm/1. μm, He; Program: 40C(3min) => 8C/min => 200(1min) => 5C/min => 300C(25min) |

Van Den Dool and Kratz RI, polar column, temperature ramp

Column type | Active phase | I | Reference | Comment |
---|---|---|---|---|
Capillary | DB-Wax | 1160. | Peng, 2000 | 15. m/0.53 mm/1. μm, He, 40. C @ 3. min, 5. K/min, 220. C @ 30. min |
Capillary | HP-Wax | 1156. | Peng, 2000 | 15. m/0.53 mm/1. μm, He, 40. C @ 3. min, 5. K/min, 220. C @ 30. min |

Normal alkane RI, non-polar column, isothermal

Column type | Active phase | Temperature (C) | I | Reference | Comment |
---|---|---|---|---|---|
Capillary | Apiezon L | 130. | 938. | Arruda, Junkes, et al., 2008 |

Normal alkane RI, non-polar column, temperature ramp

Column type | Active phase | I | Reference | Comment |
---|---|---|---|---|
Capillary | OV-101 | 926. | Dimov and Milina, 1989 | H2, 2. K/min; Column length: 50. m; Column diameter: 0.32 mm; Tstart: 40. C; Tend: 280. C |

Normal alkane RI, non-polar column, custom temperature program

Column type | Active phase | I | Reference | Comment |
---|---|---|---|---|
Capillary | OV-1, SE-30, Methyl silicone, SP-2100, OV-101, DB-1, etc. | 923. | Waggott and Davies, 1984 | Hydrogen; Column length: 50. m; Column diameter: 0.32 mm; Program: not specified |

Normal alkane RI, polar column, custom temperature program

Column type | Active phase | I | Reference | Comment |
---|---|---|---|---|
Capillary | DB-Wax | 1163. | Peng, Yang, et al., 1991 | Program: not specified |

References

Bjellerup, 1961
Bjellerup, L.,
Heats of combustion and formation of the 1-bromoalkanes from C4 through C8,
Acta Chem. Scand., 1961, 15, 231-241. [all data]
Deese, 1931
Deese, R.F., Jr.,
Thermal energy studies. IV. Comparison of continuous and discontinuous methods of measuring heat capacities. Heat capacities of some alphatic bromides,
J. Am. Chem. Soc., 1931, 53, 3673-3683. [all data]
Shehatta, 1993
Shehatta, I.,
Heat capacity at constant pressure of some halogen compounds,
Thermochim. Acta, 1993, 213, 1-10. [all data]
Farchan Laboratories, 1990
Farchan Laboratories,
Research Chemicals Catalog, Farchan Laboratories, Gainesville, FL, 1990, 91. [all data]
Weast and Grasselli, 1989
CRC Handbook of Data on Organic Compounds, 2nd Editon, Weast,R.C and Grasselli, J.G., ed(s)., CRC Press, Inc., Boca Raton, FL, 1989, 1. [all data]
American Tokyo Kasei, 1988
American Tokyo Kasei,
TCI American Organic Chemical 88/89 Catalog, American Tokyo Kasei, Portland, OR, 1988, 1610. [all data]
Lecat, 1943
Lecat, M.,
Azeotropes of Ethyl Urethane and other Azeotropes,
C. R. Hebd. Seances Acad. Sci., 1943, 217, 273. [all data]
Timmermans, 1952
Timmermans, J.,
Freezing points of organic compounds. VVI New determinations.,
Bull. Soc. Chim. Belg., 1952, 61, 393. [all data]
Deese, 1931, 2
Deese, R.F.,
Thermal energy studies: IV comparison of continuous and discontinuous methods of measuring heat capacities heat capacities of some aliphatic bromides,
J. Am. Chem. Soc., 1931, 53, 3673. [all data]
Stephenson and Malanowski, 1987
Stephenson, Richard M.; Malanowski, Stanislaw,
Handbook of the Thermodynamics of Organic Compounds, 1987, https://doi.org/10.1007/978-94-009-3173-2
. [all data]
Li and Rossini, 1961
Li, J.C.M.; Rossini, F.D.,
Vapor Pressures and Boiling Points of the l-Fluoroalkanes, l-Chloroalkanes, l-Bromoalkanes, and l-Iodoalkanes, C 1 to C 20 .,
J. Chem. Eng. Data, 1961, 6, 2, 268-270, https://doi.org/10.1021/je60010a025
. [all data]
Dykyj, 1972
Dykyj, J.,
Petrochemia, 1972, 12, 1, 13. [all data]
Domalski and Hearing, 1996
Domalski, Eugene S.; Hearing, Elizabeth D.,
Heat Capacities and Entropies of Organic Compounds in the Condensed Phase. Volume III,
J. Phys. Chem. Ref. Data, 1996, 25, 1, 1, https://doi.org/10.1063/1.555985
. [all data]
Luo and Pacey, 1992
Luo, Y.-R.; Pacey, P.D.,
Effects of alkyl substitution on ionization energies of alkanes and haloalkanes and on heats of formation of their molecular cations. Part 2. Alkanes and chloro-, bromo- and iodoalkanes,
Int. J. Mass Spectrom. Ion Processes, 1992, 112, 63. [all data]
Holmes and Lossing, 1991
Holmes, J.L.; Lossing, F.P.,
Ionization energies of homologous organic compounds and correlation with molecular size,
Org. Mass Spectrom., 1991, 26, 537. [all data]