Pentane, 1,5-dibromo-
- Formula: C5H10Br2
- Molecular weight: 229.941
- IUPAC Standard InChIKey: IBODDUNKEPPBKW-UHFFFAOYSA-N
- CAS Registry Number: 111-24-0
- Chemical structure:
View 3d structure (requires JavaScript / HTML 5) - Other names: Pentamethylene bromide; Pentamethylene dibromide; 1,5-Dibromopentane; Br(CH2)5Br; Dibromo-1,5 pentane

Condensed phase thermochemistry data

Data compiled by: Hussein Y. Afeefy, Joel F. Liebman, and Stephen E. Stein
Quantity | Value | Units | Method | Reference | Comment |
---|---|---|---|---|---|
ΔfH°liquid | -163. | kJ/mol | Eqk | Rozhnov, Alenin, et al., 1974 |

Phase change data

Data compiled as indicated in comments:
BS - Robert L. Brown and Stephen E. Stein
TRC - Thermodynamics Research Center, NIST Boulder Laboratories, Chris Muzny director
AC - William E. Acree, Jr., James S. Chickos
Quantity | Value | Units | Method | Reference | Comment |
---|---|---|---|---|---|
Tboil | 495.5 | K | N/A | Weast and Grasselli, 1989 | BS |
Quantity | Value | Units | Method | Reference | Comment |
Tfus | 233.2 | K | N/A | Timmermans, 1922 | Uncertainty assigned by TRC = 0.4 K; TRC |
Reduced pressure boiling point
Tboil (K) | Pressure (bar) | Reference | Comment |
---|---|---|---|
383.2 | 0.020 | Aldrich Chemical Company Inc., 1990 | BS |
383. | 0.020 | Farchan Laboratories, 1990 | BS |
Enthalpy of vaporization
ΔvapH (kJ/mol) | Temperature (K) | Method | Reference | Comment |
---|---|---|---|---|
54.4 | 411. | A | Stephenson and Malanowski, 1987 | Based on data from 396. to 549. K. See also Dykyj, 1972.; AC |

Reaction thermochemistry data

Data compiled by: Hussein Y. Afeefy, Joel F. Liebman, and Stephen E. Stein
Individual Reactions
By formula: C5H10Br2 = C5H10Br2
Quantity | Value | Units | Method | Reference | Comment |
---|---|---|---|---|---|
ΔrH° | -10. ± 3. | kJ/mol | Eqk | Rozhnov, Nesterova, et al., 1974 | liquid phase; Heat of isomerization |

Gas phase ion energetics data

Data compiled by: Sharon G. Lias, Rhoda D. Levin, and Sherif A. Kafafi
Ionization energy determinations
IE (eV) | Method | Reference | Comment |
---|---|---|---|
10.23 | PE | Gounelle, Menard, et al., 1975 | Vertical value |

References

Rozhnov, Alenin, et al., 1974
Rozhnov, A.M.; Alenin, V.I.; Nesterova, T.N.,
Equilibrium in the isomerisation of dibromoalkanes. IV. Isomerisation of dibromohexanes and heats of formation of certain C5-C10 dibromoalkanes,
Russ. J. Phys. Chem. (Engl. Transl.), 1974, 48, 1701-1702. [all data]
Weast and Grasselli, 1989
CRC Handbook of Data on Organic Compounds, 2nd Editon, Weast,R.C and Grasselli, J.G., ed(s)., CRC Press, Inc., Boca Raton, FL, 1989, 1. [all data]
Timmermans, 1922
Timmermans, J.,
Investigation of the Freezing Point of Organic Substances VII,
Bull. Soc. Chim. Belg., 1922, 31, 389. [all data]
Aldrich Chemical Company Inc., 1990
Aldrich Chemical Company Inc.,
Catalog Handbook of Fine Chemicals, Aldrich Chemical Company, Inc., Milwaukee WI, 1990, 1. [all data]
Farchan Laboratories, 1990
Farchan Laboratories,
Research Chemicals Catalog, Farchan Laboratories, Gainesville, FL, 1990, 91. [all data]
Stephenson and Malanowski, 1987
Stephenson, Richard M.; Malanowski, Stanislaw,
Handbook of the Thermodynamics of Organic Compounds, 1987, https://doi.org/10.1007/978-94-009-3173-2
. [all data]
Dykyj, 1972
Dykyj, J.,
Petrochemia, 1972, 12, 1, 13. [all data]
Rozhnov, Nesterova, et al., 1974
Rozhnov, A.M.; Nesterova, T.N.; Alenin, V.I.; Uskova, L.A.,
Equilibria in the isomerisation of dibromoalkanes. I. Isomerisation of 1,2-, 1,3-, 1,4-, and 1,5-dibromopentanes,
Russ. J. Phys. Chem. (Engl. Transl.), 1974, 48, 1268, In original 2136. [all data]
Gounelle, Menard, et al., 1975
Gounelle, Y.; Menard, C.; Pechine, J.M.; Solgadi, D.; Menes, F.; Botter, R.,
Conformational effects on ionization potentials; Photoelectron spectra of dibromo- and bromofluoro- alkyl compounds,
J. Electron Spectrosc. Relat. Phenom., 1975, 7, 247. [all data]