Silane, dimethoxydimethyl-
- Formula: C4H12O2Si
- Molecular weight: 120.2224
- IUPAC Standard InChIKey: JJQZDUKDJDQPMQ-UHFFFAOYSA-N
- CAS Registry Number: 1112-39-6
- Chemical structure:
View 3d structure (requires JavaScript / HTML 5) - Other names: Dimethoxydimethylsilane; Dimethyldimethoxysilane; KBM 22; CD5605; Silane, dimethyl dimethoxy

Gas phase ion energetics data

Data compiled by: Sharon G. Lias, John E. Bartmess, Joel F. Liebman, John L. Holmes, Rhoda D. Levin, and W. Gary Mallard
Ionization energy determinations
IE (eV) | Method | Reference | Comment |
---|---|---|---|
10.04 | PE | Zverev, Vakar, et al., 1986 | Vertical value |

Normal alkane RI, non-polar column, temperature ramp

Column type | Active phase | I | Reference | Comment |
---|---|---|---|---|
Capillary | OV-101 | 648. | Zenkevich, 2005 | 25. m/0.20 mm/0.10 μm, N2/He, 6. K/min; Tstart: 50. C; Tend: 250. C |
Capillary | HP-5 | 649. | Jung, Wichmann, et al., 1999 | 25. m/0.20 mm/0.33 μm, 50. C @ 3. min, 5. K/min; Tend: 180. C |

References

Zverev, Vakar, et al., 1986
Zverev, V.V.; Vakar, V.M.; Villem, Y.Y.; Villen, N.V.; Karelov, A.A.,
Photoelectron spectra and electronic structures of organophosphorus compounds. Timethylsilyl phosphites and amidophosphites,
J. Gen. Chem. USSR, 1986, 56, 1807. [all data]
Zenkevich, 2005
Zenkevich, I.G.,
Experimentally measured retention indices., 2005. [all data]
Jung, Wichmann, et al., 1999
Jung, A.; Wichmann, K.-H.; Kolb, M.,
VOC emission of polymeric packaging materials,
LaborPraxis, 1999, 23, 9, 20-22. [all data]