Ferrocene, decachloro-
- Formula: C10Cl10Fe
- Molecular weight: 530.482
- IUPAC Standard InChIKey: FFNQVLZHBWFPCP-UHFFFAOYSA-N
- CAS Registry Number: 11121-63-4
- Chemical structure:
View 3d structure (requires JavaScript / HTML 5) - Permanent link for this species. Use this link for bookmarking this species for future reference.

Gas phase ion energetics data

Data compiled by: Sharon G. Lias and Joel F. Liebman
Ionization energy determinations
IE (eV) | Method | Reference |
---|---|---|
7.65 ± 0.08 | PI | Barfuss, Emrich, et al., 1990 |
7.8 ± 0.1 | EI | Barfuss, Emrich, et al., 1990 |
Appearance energy determinations
Ion | AE (eV) | Other Products | Method | Reference | Comment |
---|---|---|---|---|---|
C5Cl2+ | 19.7 ± 0.3 | ? | EI | Barfuss, Emrich, et al., 1990 | |
C5Cl3+ | 16.8 ± 0.3 | ? | EI | Barfuss, Emrich, et al., 1990 | |
C5Cl5+ | 13.1 ± 0.1 | C5Cl5Fe | PI | Barfuss, Emrich, et al., 1990 | |
C5Cl5+ | 13.9 ± 0.3 | C5Cl5Fe | EI | Barfuss, Emrich, et al., 1990 | |
C5Cl5Fe+ | 12.8 ± 0.1 | C5Cl5 | PI | Barfuss, Emrich, et al., 1990 | |
C5Cl5Fe+ | 13.8 ± 0.2 | C5Cl5 | EI | Barfuss, Emrich, et al., 1990 | |
C10Cl6+ | 14.2 ± 0.3 | ? | EI | Barfuss, Emrich, et al., 1990 | |
C10Cl8+ | 11.8 ± 0.1 | ? | PI | Barfuss, Emrich, et al., 1990 | |
C10Cl8+ | 12.1 ± 0.2 | ? | EI | Barfuss, Emrich, et al., 1990 |

References

Barfuss, Emrich, et al., 1990
Barfuss, S.; Emrich, R.-H.; Hirschwald, W.; Dowben, P.A.; Boag, N.M.,
A mass spectrometric investigation of chloro-, bromo- and methyl-ferrocenes by electron and photon impact ionisation,
J. Org. Chem., 1990, 391, 209. [all data]