Disilanne, 1-ethenyl-1,1,2,2,2-pentamethyl-
- Formula: C7H18Si2
- Molecular weight: 158.3888
- IUPAC Standard InChIKey: CRHCLBDFINIOGN-UHFFFAOYSA-N
- CAS Registry Number: 1112-06-7
- Chemical structure:
View 3d structure (requires JavaScript / HTML 5) - Permanent link for this species. Use this link for bookmarking this species for future reference.

Gas phase ion energetics data

Data compiled as indicated in comments:
LLK - Sharon G. Lias, Rhoda D. Levin, and Sherif A. Kafafi
Ionization energy determinations
IE (eV) | Method | Reference | Comment |
---|---|---|---|
8.56 | PE | Khvostenko, Zykov, et al., 1981 | Vertical value; LLK |

References

Khvostenko, Zykov, et al., 1981
Khvostenko, V.I.; Zykov, B.G.; Yuriev, V.P.; Mironov, V.F.; Kovel'zon, G.I.; Panasenko, A.A.; Sheludyakov, V.D.; Gailyunas, I.A.,
Study of d(π)-p(π) interaction in vinyl- and alkylsilicon-containing compounds by photoelectron spectroscopy,
J. Organomet. Chem., 1981, 218, 155. [all data]