2-Ethoxyethyl acetate
- Formula: C6H12O3
- Molecular weight: 132.1577
- IUPAC Standard InChIKey: SVONRAPFKPVNKG-UHFFFAOYSA-N
- CAS Registry Number: 111-15-9
- Chemical structure:
View 3d structure (requires JavaScript / HTML 5) - Other names: Ethanol, 2-ethoxy-, acetate; β-Ethoxyethyl acetate; Cellosolve acetate; Ethyl cellosolve acetate; Ethyl glycol acetate; Ethylene glycol ethyl ether acetate; Glycol monoethyl ether acetate; Oxitol acetate; Poly-Solv EE acetate; 1-Acetoxy-2-ethoxyethane; 2-Ethoxyethanol acetate; 2-Ethoxyethanol, ester with acetic acid; Ethoxyethyl acetate; Ethylene glycol monoethyl ether acetate; Acetate d'ethylglycol; Acetate de cellosolve; Acetate de l'ether monoethylique de l'ethylene-glycol; Acetato di cellosolve; Acetic acid, 2-ethoxyethyl ester; Aethylenglykolaetheracetat; CSAC; Ethyl cellosolve acetaat; Ethylglykolacetat; Octan etoksyetylu; Oxytol acetate; 2-Aethoxy-aethylacetat; 2-Ethoxy-ethylacetaat; 2-Ethoxyethyle, acetate de; 2-Etossietil-acetato; Celosolvacetat; Ektasolve EE acetate solvent; 2-Ethoxyethylester kyseliny octove; Glycol ether EE acetate; UN 1172; 2-Ethoxyethyl ester of acetic acid; Ethoxyethanol acetate; Ethylene glycol monoethyl ether monoacetate; NSC 8658; Cellosove acetate; Ethoxy acetate; ''cellosolve'' Acetate; 2-Ethoxy etheracetate; 2EEA; EE acetate; EEA; Ethyl acetyl glycolate; Ethylene glycol monethyl ether acetate; Sensolve EEA

Condensed phase thermochemistry data

Data compiled by: Eugene S. Domalski and Elizabeth D. Hearing
Constant pressure heat capacity of liquid
Cp,liquid (J/mol*K) | Temperature (K) | Reference | Comment |
---|---|---|---|
376. | 298.15 | Sandulescu, Ciopec, et al., 1983 | T = 273.15 to 323.15 K. Cp°(kJ/kg*K) = 0.009426T + 0.036. |

Phase change data

Data compiled as indicated in comments:
BS - Robert L. Brown and Stephen E. Stein
TRC - Thermodynamics Research Center, NIST Boulder Laboratories, Chris Muzny director
ALS - Hussein Y. Afeefy, Joel F. Liebman, and Stephen E. Stein
AC - William E. Acree, Jr., James S. Chickos
Quantity | Value | Units | Method | Reference | Comment |
---|---|---|---|---|---|
Tboil | 429.6 | K | N/A | Weast and Grasselli, 1989 | BS |
Tboil | 429.3 | K | N/A | Kusano, 1978 | Uncertainty assigned by TRC = 0.3 K; TRC |
Quantity | Value | Units | Method | Reference | Comment |
Tc | 610.6 | K | N/A | Steele, Chirico, et al., 1996 | Uncertainty assigned by TRC = 1.5 K; TRC |
Tc | 608.7 | K | N/A | Teja and Anselme, 1990 | Uncertainty assigned by TRC = 0.6 K; TRC |
Tc | 607.3 | K | N/A | Teja and Rosenthal, 1990 | Uncertainty assigned by TRC = 0.8 K; TRC |
Quantity | Value | Units | Method | Reference | Comment |
Pc | 31.80 | bar | N/A | Steele, Chirico, et al., 1996 | Uncertainty assigned by TRC = 1.50 bar; from extraploation of obs. vapor pressures to Tc; TRC |
Pc | 31.66 | bar | N/A | Teja and Rosenthal, 1990 | Uncertainty assigned by TRC = 0.40 bar; TRC |
Quantity | Value | Units | Method | Reference | Comment |
ρc | 2.27 | mol/l | N/A | Steele, Chirico, et al., 1996 | Uncertainty assigned by TRC = 0.091 mol/l; TRC |
ρc | 2.25 | mol/l | N/A | Teja and Anselme, 1990 | Uncertainty assigned by TRC = 0.05 mol/l; TRC |
Quantity | Value | Units | Method | Reference | Comment |
ΔvapH° | 52.69 ± 0.02 | kJ/mol | C | Kusano and Wads, 1970 | ALS |
ΔvapH° | 52.7 ± 0.1 | kJ/mol | C | Kusano and Wadso, 1970 | AC |
ΔvapH° | 52.6 ± 0.4 | kJ/mol | EB | Bott and Sadler, 1966 | Based on data from 330. to 468. K.; AC |
Enthalpy of vaporization
ΔvapH (kJ/mol) | Temperature (K) | Method | Reference | Comment |
---|---|---|---|---|
50.9 | 337. | A | Stephenson and Malanowski, 1987 | Based on data from 322. to 430. K.; AC |

Kovats' RI, non-polar column, isothermal

Column type | Active phase | Temperature (C) | I | Reference | Comment |
---|---|---|---|---|---|
Capillary | SPB-1 | 60. | 882. | Castello, Vezzani, et al., 1991 | N2; Column length: 60. m; Column diameter: 0.75 mm |
Packed | SE-30 | 150. | 875. | Tiess, 1984 | Ar, Gas Chrom Q (80-100 mesh); Column length: 3. m |

Kovats' RI, non-polar column, temperature ramp

Column type | Active phase | I | Reference | Comment |
---|---|---|---|---|
Capillary | CBP-1 | 888. | Shimadzu, 2003 | 25. m/0.2 mm/0.25 μm, He, 50. C @ 5. min, 4. K/min; Tend: 200. C |

Kovats' RI, polar column, isothermal

Column type | Active phase | Temperature (C) | I | Reference | Comment |
---|---|---|---|---|---|
Capillary | Supelcowax-10 | 60. | 1319. | Castello, Vezzani, et al., 1991 | N2; Column length: 60. m; Column diameter: 0.75 mm |

Kovats' RI, polar column, temperature ramp

Column type | Active phase | I | Reference | Comment |
---|---|---|---|---|
Capillary | CBP-20 | 1299. | Shimadzu, 2003 | 25. m/0.2 mm/0.25 μm, He, 50. C @ 5. min, 4. K/min; Tend: 200. C |

Van Den Dool and Kratz RI, non-polar column, temperature ramp

Column type | Active phase | I | Reference | Comment |
---|---|---|---|---|
Capillary | DB-1 | 880.8 | Sun and Stremple, 2003 | 30. m/0.25 mm/0.25 μm, He, 3. K/min; Tstart: 40. C; Tend: 325. C |

Van Den Dool and Kratz RI, non-polar column, custom temperature program

Column type | Active phase | I | Reference | Comment |
---|---|---|---|---|
Capillary | VF-5MS | 909.4 | Zheng and White, 2008 | 30. m/0.25 mm/0.25 μm, He; Program: not specified |

Van Den Dool and Kratz RI, polar column, temperature ramp

Column type | Active phase | I | Reference | Comment |
---|---|---|---|---|
Capillary | Supelcowax-10 | 1299. | Chung, Yung, et al., 2002 | 60. m/0.25 mm/0.25 μm, He, 35. C @ 5. min, 2. K/min, 195. C @ 90. min |
Capillary | Supelcowax-10 | 1299. | Chung, Yung, et al., 2001 | 60. m/0.25 mm/0.25 μm, He, 35. C @ 5. min, 2. K/min, 195. C @ 90. min |

Normal alkane RI, non-polar column, isothermal

Column type | Active phase | Temperature (C) | I | Reference | Comment |
---|---|---|---|---|---|
Capillary | DB-1 | 60. | 859. | Shimadzu, 2003, 2 | 60. m/0.32 mm/1. μm, He |
Packed | DC-400 | 150. | 852. | Anderson, 1968 | Helium, Gas-Pak (60-80 mesh); Column length: 3.0 m |

Normal alkane RI, non-polar column, temperature ramp

Column type | Active phase | I | Reference | Comment |
---|---|---|---|---|
Capillary | BP-1 | 876. | Health Safety Executive, 2000 | 50. m/0.22 mm/0.75 μm, He, 5. K/min; Tstart: 50. C; Tend: 200. C |

Normal alkane RI, non-polar column, custom temperature program

Column type | Active phase | I | Reference | Comment |
---|---|---|---|---|
Capillary | SPB-1 | 876. | Flanagan, Streete, et al., 1997 | 60. m/0.53 mm/5. μm, He; Program: 40C(6min) => 5C/min => 80C => 10C/min => 200C |
Capillary | SPB-1 | 876. | Strete, Ruprah, et al., 1992 | 60. m/0.53 mm/5.0 μm, Helium; Program: 40 0C (6 min) 5 0C/min -> 80 0C 10 0C/min -> 200 0C |
Capillary | SPB-1 | 874. | Strete, Ruprah, et al., 1992 | 60. m/0.53 mm/5.0 μm, Helium; Program: not specified |
Capillary | OV-1 | 872. | Ramsey and Flanagan, 1982 | Program: not specified |

Normal alkane RI, polar column, isothermal

Column type | Active phase | Temperature (C) | I | Reference | Comment |
---|---|---|---|---|---|
Capillary | DB-Wax | 60. | 1318. | Shimadzu, 2003, 2 | 50. m/0.32 mm/1. μm, He |

Normal alkane RI, polar column, custom temperature program

Column type | Active phase | I | Reference | Comment |
---|---|---|---|---|
Capillary | DB-Wax | 1290. | Peng, Yang, et al., 1991 | Program: not specified |
Capillary | Carbowax 20M | 1305. | Ramsey and Flanagan, 1982 | Program: not specified |

References

Sandulescu, Ciopec, et al., 1983
Sandulescu, D.; Ciopec, M.; Pantea, O.,
Evaluation of heat capacity of liquids using noncalorimetric methods,
Rev. Chim. (Bucharest), 1983, 34, 24-43. [all data]
Weast and Grasselli, 1989
CRC Handbook of Data on Organic Compounds, 2nd Editon, Weast,R.C and Grasselli, J.G., ed(s)., CRC Press, Inc., Boca Raton, FL, 1989, 1. [all data]
Kusano, 1978
Kusano, K.,
Densities, Refractive Indexes, and Normal Boiling Points of 1,2-Disubstituted Ethylene Glycol Derivatives,
J. Chem. Eng. Data, 1978, 23, 141. [all data]
Steele, Chirico, et al., 1996
Steele, W.V.; Chirico, R.D.; Knipmeyer, S.E.; Nguyen, A.,
Vapor pressure of acetophenone, (+-)-1,2-butanediol, (+-)-1,3-butanediol, diethylene glycol monopropyl ether, 1,3-dimethyladamantane, 2-ethoxyethyl acetate, ethyl octyl sufide, and pentyl acetate,
J. Chem. Eng. Data, 1996, 41, 1255-68. [all data]
Teja and Anselme, 1990
Teja, A.S.; Anselme, M.J.,
The critical properties of thermally stable and unstable fluids. II. 1986 results,
AIChE Symp. Ser., 1990, 86, 279, 122-7. [all data]
Teja and Rosenthal, 1990
Teja, A.S.; Rosenthal, D.J.,
The Critical Pressures and Temperatures of Twelve Substances Using A Low Residence Time Flow Apparatus,
AIChE Symp. Ser., 1990, 86, 279, 133-7. [all data]
Kusano and Wads, 1970
Kusano, K.; Wads, I.,
Enthalpies of vaporization of organic compounds,
Acta Chem. Scand., 1970, 24, 2037. [all data]
Kusano and Wadso, 1970
Kusano, K.; Wadso, I.,
Enthalpies of vaporization of organic compounds,
Acta Chem. Scand., 1970, 24, 2037-2042. [all data]
Bott and Sadler, 1966
Bott, T.R.; Sadler, H.N.,
Vapor Pressure of Propylene Oxide.,
J. Chem. Eng. Data, 1966, 11, 1, 25-25, https://doi.org/10.1021/je60028a005
. [all data]
Stephenson and Malanowski, 1987
Stephenson, Richard M.; Malanowski, Stanislaw,
Handbook of the Thermodynamics of Organic Compounds, 1987, https://doi.org/10.1007/978-94-009-3173-2
. [all data]
Castello, Vezzani, et al., 1991
Castello, G.; Vezzani, S.; Gerbino, T.,
Gas chromatographic separation and automatic identification of complex mixtures of organic solvents in indrustrial wates,
J. Chromatogr., 1991, 585, 2, 273-280, https://doi.org/10.1016/0021-9673(91)85088-W
. [all data]
Tiess, 1984
Tiess, D.,
Gaschromatographische Retentionsindices von 125 leicht- bis mittelflüchtigen organischen Substanzen toxikologisch-analytischer Relevanz auf SE-30,
Wiss. Z. Wilhelm-Pieck-Univ. Rostock Math. Naturwiss. Reihe, 1984, 33, 6-9. [all data]
Shimadzu, 2003
Shimadzu,
Gas chromatography analysis of organic solvents using capillary columns (No. 2), 2003, retrieved from http://www.shimadzu.com/apps/form.cfm. [all data]
Sun and Stremple, 2003
Sun, G.; Stremple, P.,
Retention index characterization of flavor, fragrance, and many other compounds on DB-1 and DB-XLB, 2003, retrieved from http://www.chem.agilent.com/cag/cabu/pdf/b-0279.pdf. [all data]
Zheng and White, 2008
Zheng, Y.; White, E.,
Retention Data. NIST Mass Spectrometry Data Center., NIST Mass Spectrometry Data Center, 2008. [all data]
Chung, Yung, et al., 2002
Chung, H.-Y.; Yung, I.K.S.; Ma, W.C.J.; Kim, J.-S.,
Analysis of volatile components in frozen and dried scallops (Patinopecten yessoensis) by gas chromatography/mass spectrometry,
Food Res. Int., 2002, 35, 1, 43-53, https://doi.org/10.1016/S0963-9969(01)00107-7
. [all data]
Chung, Yung, et al., 2001
Chung, H.Y.; Yung, I.K.S.; Kim, J.-S.,
Comparison of volatile components in dried scallops (Chlamys farreri and Patinopecten yessoensis) prepared by boiling and steaming methods,
J. Agric. Food Chem., 2001, 49, 1, 192-202, https://doi.org/10.1021/jf000692a
. [all data]
Shimadzu, 2003, 2
Shimadzu,
Gas chromatography analysis of organic solvents using capillary columns (No. 3), 2003, retrieved from http://www.shimadzu.com/apps/form.cfm. [all data]
Anderson, 1968
Anderson, D.G.,
USe of Kovats retention indices and response factors for the qualitative and quantitative analysis of coating solvents,
J. Paint Technol., 1968, 40, 527, 549-557. [all data]
Health Safety Executive, 2000
Health Safety Executive,
MDHS 96 Volatile organic compounds in air - Laboratory method using pumed solid sorbent tubes, solvent desorption and gas chromatography
in Methods for the Determination of Hazardous Substances (MDHS) guidance, Crown, Colegate, Norwich, 2000, 1-24, retrieved from http://www.hse.gov.uk/pubns/mdhs/pdfs/mdhs96.pdf. [all data]
Flanagan, Streete, et al., 1997
Flanagan, R.J.; Streete, P.J.; Ramsey, J.D.,
Volatile Substance Abuse, UNODC Technical Series, No 5, United Nations, Office on Drugs and Crime, Vienna International Centre, PO Box 500, A-1400 Vienna, Austria, 1997, 56, retrieved from http://www.odccp.org/pdf/technicalseries1997-01-011.pdf. [all data]
Strete, Ruprah, et al., 1992
Strete, P.J.; Ruprah, M.; Ramsey, J.D.; Flanagan, R.J.,
Detection and identification of volatile substances by headspace capillary gas chromatography to aid the diagnosis of acute poisoning,
Analyst, 1992, 117, 7, 1111-1127, https://doi.org/10.1039/an9921701111
. [all data]
Ramsey and Flanagan, 1982
Ramsey, J.D.; Flanagan, R.J.,
Detection and Identification of Volatile Organic Compounds in Blood by Headspace Gas Chromatography as an Aid to the Diagnosis of Solvent Abuse,
J. Chromatogr., 1982, 240, 2, 423-444, https://doi.org/10.1016/S0021-9673(00)99622-5
. [all data]
Peng, Yang, et al., 1991
Peng, C.T.; Yang, Z.C.; Ding, S.F.,
Prediction of rentention idexes. II. Structure-retention index relationship on polar columns,
J. Chromatogr., 1991, 586, 1, 85-112, https://doi.org/10.1016/0021-9673(91)80028-F
. [all data]