1,3-Propanediamine, N,N,N',N'-tetramethyl-
- Formula: C7H18N2
- Molecular weight: 130.2312
- IUPAC Standard InChIKey: DMQSHEKGGUOYJS-UHFFFAOYSA-N
- CAS Registry Number: 110-95-2
- Chemical structure:
View 3d structure (requires JavaScript / HTML 5) - Other names: Bis[(dimethylamino)methyl]methane; N,N,N',N'-Tetramethyl-1,3-diaminopropane; N,N,N',N'-Tetramethyl-1,3-propanediamine; N,N,N',N'-Tetramethyltrimethylenediamine; Tetramethylpropanediamine; 1,3-Bis(dimethylamino)propane; (CH3)2N(CH2)3N(CH3)2; Tetramethyltrimethylenediamine; Propane-1,3-diamine, N,N,N',N'-tetramethyl-

Phase change data

Data compiled as indicated in comments:
BS - Robert L. Brown and Stephen E. Stein
TRC - Thermodynamics Research Center, NIST Boulder Laboratories, Chris Muzny director
Quantity | Value | Units | Method | Reference | Comment |
---|---|---|---|---|---|
Tboil | 418.7 | K | N/A | Aldrich Chemical Company Inc., 1990 | BS |
Tboil | 417.2 | K | N/A | Weast and Grasselli, 1989 | BS |
Quantity | Value | Units | Method | Reference | Comment |
Tfus | 191.2 | K | N/A | Anonymous, 1959 | Uncertainty assigned by TRC = 0.6 K; TRC |

Gas phase ion energetics data

Data evaluated as indicated in comments:
HL - Edward P. Hunter and Sharon G. Lias
Data compiled as indicated in comments:
LLK - Sharon G. Lias, Rhoda D. Levin, and Sherif A. Kafafi
Quantity | Value | Units | Method | Reference | Comment |
---|---|---|---|---|---|
Proton affinity (review) | 247.42 | kcal/mol | N/A | Hunter and Lias, 1998 | HL |
Quantity | Value | Units | Method | Reference | Comment |
Gas basicity | 235.5 | kcal/mol | N/A | Hunter and Lias, 1998 | HL |
Ionization energy determinations
IE (eV) | Method | Reference | Comment |
---|---|---|---|
7.6 | PE | Livant, Roberts, et al., 1981 | LLK |
7.84 | PE | Livant, Roberts, et al., 1981 | Vertical value; LLK |

References

Aldrich Chemical Company Inc., 1990
Aldrich Chemical Company Inc.,
Catalog Handbook of Fine Chemicals, Aldrich Chemical Company, Inc., Milwaukee WI, 1990, 1. [all data]
Weast and Grasselli, 1989
CRC Handbook of Data on Organic Compounds, 2nd Editon, Weast,R.C and Grasselli, J.G., ed(s)., CRC Press, Inc., Boca Raton, FL, 1989, 1. [all data]
Anonymous, 1959
Anonymous, R.,
, Am. Pet. Inst. Res. Proj. 6, Carnegie-Mellon Univ., 1959. [all data]
Hunter and Lias, 1998
Hunter, E.P.; Lias, S.G.,
Evaluated Gas Phase Basicities and Proton Affinities of Molecules: An Update,
J. Phys. Chem. Ref. Data, 1998, 27, 3, 413-656, https://doi.org/10.1063/1.556018
. [all data]
Livant, Roberts, et al., 1981
Livant, P.; Roberts, K.A.; Eggers, M.D.; Worley, S.D.,
The gas phase conformation of 3,7-dimethyl-3,7-diazabicyclo[3.3.1]nonane,
Tetrahedron, 1981, 37, 1853. [all data]