Tetracopper tetrachloride

Gas phase ion energetics data

Data compiled by: Sharon G. Lias, Rhoda D. Levin, and Sherif A. Kafafi

Ionization energy determinations

IE (eV) Method Reference
9.3EIBloom and Williams, 1981
9.6 ± 0.5EIWagner, Robert, et al., 1974
9.9 ± 0.5EIGuido, Balducci, et al., 1971

Appearance energy determinations

Ion AE (eV) Other Products MethodReferenceComment
Cl2Cu2+14.0 ± 0.5?EIGuido, Balducci, et al., 1971
Cl3Cu3+10.4 ± 1.0CuClEIWagner, Robert, et al., 1974
Cl3Cu4+12.2 ± 0.5ClEIWagner, Robert, et al., 1974
Cl3Cu4+12.4 ± 0.5ClEIGuido, Balducci, et al., 1971
Cu+14.0 ± 0.5?EIWagner, Robert, et al., 1974

References

Bloom and Williams, 1981
Bloom, H.; Williams, D.J., A mass spectrometric study of the vapors above the molten salt systems LiCl-CuCl, LiBr-CuBr, and NaI-CuI, J. Chem. Phys., 1981, 75, 4636. [all data]

Wagner, Robert, et al., 1974
Wagner, L.C.; Robert, P.; Grindstaff, Q.; Grimley, R.T., A mass spectrometric study of the fragmentation of the cuprous chloride vapor system, Int. J. Mass Spectrom. Ion Phys., 1974, 15, 255. [all data]

Guido, Balducci, et al., 1971
Guido, M.; Balducci, G.; Gigli, G.; Spoliti, M., Mass spectrometric study of the vaporization of cuprous chloride and the dissociation energy of Cu3Cl3, Cu4Cl4, and Cu5Cl5, J. Chem. Phys., 1971, 55, 4566. [all data]