Yttrium trimer
- Formula: Y3
- Molecular weight: 266.71755
- CAS Registry Number: 110873-00-2

Gas phase ion energetics data

Data compiled by: Sharon G. Lias and Joel F. Liebman
Ionization energy determinations
IE (eV) | Method | Reference | Comment |
---|---|---|---|
5.00 | PI | Knickelbein, 1995 | Vertical value |

References

Knickelbein, 1995
Knickelbein, M.,
Photoionization spectroscopy of yttrium clusters: Ionization potentials for Yn and YnO (n=2-31),
J. Chem. Phys., 1995, 102, 1. [all data]